BDBM50145252 1-{4-[(9-Fluoro-5,6-dihydro-4H-3-thia-1-aza-benzo[e]azulen-2-ylamino)-methyl]-piperidin-1-yl}-2-morpholin-4-yl-ethanone::CHEMBL81586
SMILES: Fc1ccc2CCCc3sc(NCC4CCN(CC4)C(=O)CN4CCOCC4)nc3-c2c1
InChI Key: InChIKey=YWYJUBVYMHXSOH-UHFFFAOYSA-N
Data: 1 IC50
Activity Spreadsheet -- Enzyme Inhibition Constant Data from BindingDB
Found 1 hit for monomerid = 50145252
Trg + Lig
Ki
nM
ΔG°
kcal/mole
IC50
nM
Kd
nM
EC50/IC50
nM
koff
s-1
kon
M-1s-1
pHTemp
°C
Neuropeptide Y receptor type 5 ( NPY Y5)
(Homo sapiens (Human))
BDBM50145252
(1-{4-[(9-Fluoro-5,6-dihydro-4H-3-thia-1-aza-benzo[...)
Show SMILES Fc1ccc2CCCc3sc(NCC4CCN(CC4)C(=O)CN4CCOCC4)nc3-c2c1
Show InChI InChI=1S/C24H31FN4O2S/c25-19-5-4-18-2-1-3-21-23(20(18)14-19)27-24(32-21)26-15-17-6-8-29(9-7-17)22(30)16-28-10-12-31-13-11-28/h4-5,14,17H,1-3,6-13,15-16H2,(H,26,27)
n/an/a 2n/an/an/an/an/an/a
Novartis Pharma AG
Curated by ChEMBL
Assay Description
In vitro binding affinity of the compound against human neuropeptide Y5 receptor
Bioorg Med Chem Lett 14: 2451-7 (2004)
Article DOI: 10.1016/j.bmcl.2004.03.014
BindingDB Entry DOI: 10.7270/Q2WM1CV1