BDBM50145270 CHEMBL81994::{4-[(9-Fluoro-5,6-dihydro-4H-3-thia-1-aza-benzo[e]azulen-2-ylamino)-methyl]-piperidin-1-yl}-(tetrahydro-furan-3-yl)-methanone
SMILES: Fc1ccc2CCCc3sc(NCC4CCN(CC4)C(=O)C4CCOC4)nc3-c2c1
InChI Key: InChIKey=NQCPEJHYEAKQBY-UHFFFAOYSA-N
Data: 1 IC50
Activity Spreadsheet -- Enzyme Inhibition Constant Data from BindingDB
Found 1 hit for monomerid = 50145270
Trg + Lig
Ki
nM
ΔG°
kcal/mole
IC50
nM
Kd
nM
EC50/IC50
nM
koff
s-1
kon
M-1s-1
pHTemp
°C
Neuropeptide Y receptor type 5 ( NPY Y5)
(Homo sapiens (Human))
BDBM50145270
(CHEMBL81994 | {4-[(9-Fluoro-5,6-dihydro-4H-3-thia-...)
Show SMILES Fc1ccc2CCCc3sc(NCC4CCN(CC4)C(=O)C4CCOC4)nc3-c2c1
Show InChI InChI=1S/C23H28FN3O2S/c24-18-5-4-16-2-1-3-20-21(19(16)12-18)26-23(30-20)25-13-15-6-9-27(10-7-15)22(28)17-8-11-29-14-17/h4-5,12,15,17H,1-3,6-11,13-14H2,(H,25,26)
n/an/a 1n/an/an/an/an/an/a
Novartis Pharma AG
Curated by ChEMBL
Assay Description
In vitro binding affinity of the compound against human neuropeptide Y5 receptor
Bioorg Med Chem Lett 14: 2451-7 (2004)
Article DOI: 10.1016/j.bmcl.2004.03.014
BindingDB Entry DOI: 10.7270/Q2WM1CV1