BDBM50145301 CHEMBL310209::Phenethyl-[6-(3-phenyl-[1,2,4]triazolo[3,4-a]phthalazin-6-yloxymethyl)-pyridin-2-ylmethyl]-amine
SMILES: C(Cc1ccccc1)NCc1cccc(COc2nn3c(nnc3c3ccccc23)-c2ccccc2)n1
InChI Key: InChIKey=BYBVYBPNKHNUTQ-UHFFFAOYSA-N
Data: 1 IC50
Activity Spreadsheet -- Enzyme Inhibition Constant Data from BindingDB
Found 1 hit for monomerid = 50145301
Trg + Lig
Ki
nM
ΔG°
kcal/mole
IC50
nM
Kd
nM
EC50/IC50
nM
koff
s-1
kon
M-1s-1
pHTemp
°C
Voltage-dependent calcium channel subunit alpha-2/delta-1
(Homo sapiens (Human))
BDBM50145301
(CHEMBL310209 | Phenethyl-[6-(3-phenyl-[1,2,4]triaz...)
Show SMILES C(Cc1ccccc1)NCc1cccc(COc2nn3c(nnc3c3ccccc23)-c2ccccc2)n1
Show InChI InChI=1S/C30H26N6O/c1-3-10-22(11-4-1)18-19-31-20-24-14-9-15-25(32-24)21-37-30-27-17-8-7-16-26(27)29-34-33-28(36(29)35-30)23-12-5-2-6-13-23/h1-17,31H,18-21H2
n/an/a 195n/an/an/an/an/an/a
Merck Research Laboratories
Curated by ChEMBL
Assay Description
Binding affinity against alpha-2 delta-1 subunit of voltage gated subunit of Ca+2 channel in human
Bioorg Med Chem Lett 14: 2463-7 (2004)
Article DOI: 10.1016/j.bmcl.2004.03.008
BindingDB Entry DOI: 10.7270/Q23X876G