BDBM50145383 CHEMBL3763953
SMILES: COC(=O)c1c(N2CCCCC2)c(=O)c(O)c2oc3cc(ccc3nc12)N(C)C
InChI Key: InChIKey=KFSCTBSLLZLSNB-UHFFFAOYSA-N
Data: 1 IC50
Activity Spreadsheet -- Enzyme Inhibition Constant Data from BindingDB
Found 1 hit for monomerid = 50145383
Trg + Lig
Ki
nM
ΔG°
kcal/mole
IC50
nM
Kd
nM
EC50/IC50
nM
koff
s-1
kon
M-1s-1
pHTemp
°C
Low-density lipoprotein receptor-related protein 6
(Homo sapiens (Human))
BDBM50145383
(CHEMBL3763953)
Show SMILES COC(=O)c1c(N2CCCCC2)c(=O)c(O)c2oc3cc(ccc3nc12)N(C)C
Show InChI InChI=1S/C21H23N3O5/c1-23(2)12-7-8-13-14(11-12)29-20-16(22-13)15(21(27)28-3)17(18(25)19(20)26)24-9-5-4-6-10-24/h7-8,11,26H,4-6,9-10H2,1-3H3
n/an/a 5.50E+3n/an/an/an/an/an/a
Aristotle University of Thessaloniki
Curated by ChEMBL
Assay Description
Binding affinity to human LRP6 expressed in HEK293 cells assessed as inhibition of DKK1/LRP6 interaction using compound pre-treated DKK1 conditioned ...
Bioorg Med Chem 24: 1014-22 (2016)
BindingDB Entry DOI: 10.7270/Q2J67JRS