BDBM50145492 (2S,3R)-3-Cyclopentyl-2-[4-(2-piperidin-1-yl-ethoxy)-phenyl]-2,3-dihydro-benzo[1,4]oxathiin-6-ol::CHEMBL431611
SMILES: Oc1ccc2O[C@H]([C@H](Sc2c1)C1CCCC1)c1ccc(OCCN2CCCCC2)cc1
InChI Key: InChIKey=AHXSKOONHHFRDE-IZZNHLLZSA-N
Data: 3 IC50
Activity Spreadsheet -- Enzyme Inhibition Constant Data from BindingDB
Found 3 hits for monomerid = 50145492
Trg + Lig
Ki
nM
ΔG°
kcal/mole
IC50
nM
Kd
nM
EC50/IC50
nM
koff
s-1
kon
M-1s-1
pHTemp
°C
Estrogen receptor
(Homo sapiens (Human))
BDBM50145492
((2S,3R)-3-Cyclopentyl-2-[4-(2-piperidin-1-yl-ethox...)
Show SMILES Oc1ccc2O[C@H]([C@H](Sc2c1)C1CCCC1)c1ccc(OCCN2CCCCC2)cc1
Show InChI InChI=1S/C26H33NO3S/c28-21-10-13-23-24(18-21)31-26(20-6-2-3-7-20)25(30-23)19-8-11-22(12-9-19)29-17-16-27-14-4-1-5-15-27/h8-13,18,20,25-26,28H,1-7,14-17H2/t25-,26+/m0/s1
n/an/a 2.5n/an/an/an/an/an/a
Merck Research Laboratories
Curated by ChEMBL
Assay Description
Binding affinity towards human estrogen receptor alpha
Bioorg Med Chem Lett 14: 2551-4 (2004)
Article DOI: 10.1016/j.bmcl.2004.02.084
BindingDB Entry DOI: 10.7270/Q27W6BM7
Estrogen receptor
(Homo sapiens (Human))
BDBM50145492
((2S,3R)-3-Cyclopentyl-2-[4-(2-piperidin-1-yl-ethox...)
Show SMILES Oc1ccc2O[C@H]([C@H](Sc2c1)C1CCCC1)c1ccc(OCCN2CCCCC2)cc1
Show InChI InChI=1S/C26H33NO3S/c28-21-10-13-23-24(18-21)31-26(20-6-2-3-7-20)25(30-23)19-8-11-22(12-9-19)29-17-16-27-14-4-1-5-15-27/h8-13,18,20,25-26,28H,1-7,14-17H2/t25-,26+/m0/s1
n/an/a 22n/an/an/an/an/an/a
Merck Research Laboratories
Curated by ChEMBL
Assay Description
In vivo inhibition of human ERalpha/ERbeta co-expressed in HEK 293 cells; 22/252
Bioorg Med Chem Lett 14: 2551-4 (2004)
Article DOI: 10.1016/j.bmcl.2004.02.084
BindingDB Entry DOI: 10.7270/Q27W6BM7
Estradiol receptor beta (ERβ)
(Homo sapiens (Human))
BDBM50145492
((2S,3R)-3-Cyclopentyl-2-[4-(2-piperidin-1-yl-ethox...)
Show SMILES Oc1ccc2O[C@H]([C@H](Sc2c1)C1CCCC1)c1ccc(OCCN2CCCCC2)cc1
Show InChI InChI=1S/C26H33NO3S/c28-21-10-13-23-24(18-21)31-26(20-6-2-3-7-20)25(30-23)19-8-11-22(12-9-19)29-17-16-27-14-4-1-5-15-27/h8-13,18,20,25-26,28H,1-7,14-17H2/t25-,26+/m0/s1
n/an/a 31n/an/an/an/an/an/a
Merck Research Laboratories
Curated by ChEMBL
Assay Description
Binding affinity towards human estrogen receptor beta (ERbeta)
Bioorg Med Chem Lett 14: 2551-4 (2004)
Article DOI: 10.1016/j.bmcl.2004.02.084
BindingDB Entry DOI: 10.7270/Q27W6BM7