BDBM50145804 3-(4-Hydroxy-3,5-diiodo-phenyl)-2-phenyl-propionic acid::CHEMBL83906::Iodoalphionic acid
SMILES: OC(=O)C(Cc1cc(I)c(O)c(I)c1)c1ccccc1
InChI Key: InChIKey=IKYIXZSIKOYSLD-UHFFFAOYSA-N
Data: 1 KI  1 Kd
Activity Spreadsheet -- Enzyme Inhibition Constant Data from BindingDB
Found 2 hits for monomerid = 50145804
Trg + Lig
Ki
nM
ΔG°
kcal/mole
IC50
nM
Kd
nM
EC50/IC50
nM
koff
s-1
kon
M-1s-1
pHTemp
°C
Genome polyprotein
(Hepatitis C virus)
BDBM50145804
(3-(4-Hydroxy-3,5-diiodo-phenyl)-2-phenyl-propionic...)
Show SMILES OC(=O)C(Cc1cc(I)c(O)c(I)c1)c1ccccc1
Show InChI InChI=1S/C15H12I2O3/c16-12-7-9(8-13(17)14(12)18)6-11(15(19)20)10-4-2-1-3-5-10/h1-5,7-8,11,18H,6H2,(H,19,20)
1.40E+5n/an/an/an/an/an/an/an/a
Schering-Plough Research Institute
Curated by ChEMBL
Assay Description
Inhibition constant for HCV NS3 protease substrate binding site
J Med Chem 47: 2486-98 (2004)
Article DOI: 10.1021/jm0305117
BindingDB Entry DOI: 10.7270/Q2FF3RSP
Genome polyprotein
(Hepatitis C virus)
BDBM50145804
(3-(4-Hydroxy-3,5-diiodo-phenyl)-2-phenyl-propionic...)
Show SMILES OC(=O)C(Cc1cc(I)c(O)c(I)c1)c1ccccc1
Show InChI InChI=1S/C15H12I2O3/c16-12-7-9(8-13(17)14(12)18)6-11(15(19)20)10-4-2-1-3-5-10/h1-5,7-8,11,18H,6H2,(H,19,20)
n/an/an/a 1.10E+5n/an/an/an/an/a
Schering-Plough Research Institute
Curated by ChEMBL
Assay Description
Dissociation constant for HCV NS3 protease substrate binding site
J Med Chem 47: 2486-98 (2004)
Article DOI: 10.1021/jm0305117
BindingDB Entry DOI: 10.7270/Q2FF3RSP