null
SMILES: OC(=O)c1ccccc1C(=O)c1cccc(Cl)c1
InChI Key: InChIKey=FSMXJLAATHSRCB-UHFFFAOYSA-N
Activity Spreadsheet -- Enzyme Inhibition Constant Data from BindingDB
Found 1 hit for monomerid = 50145846
Trg + Lig
Ki
nM
ΔG°
kcal/mole
IC50
nM
Kd
nM
EC50/IC50
nM
koff
s-1
kon
M-1s-1
pHTemp
°C
Genome polyprotein
(Hepatitis C virus)
BDBM50145846
(2-(3-Chloro-benzoyl)-benzoic acid | CHEMBL84009)
Show SMILES OC(=O)c1ccccc1C(=O)c1cccc(Cl)c1
Show InChI InChI=1S/C14H9ClO3/c15-10-5-3-4-9(8-10)13(16)11-6-1-2-7-12(11)14(17)18/h1-8H,(H,17,18)
n/an/an/a>1.00E+4n/an/an/an/an/a
Schering-Plough Research Institute
Curated by ChEMBL
Assay Description
Dissociation constant for HCV NS3 protease substrate binding site
J Med Chem 47: 2486-98 (2004)
Article DOI: 10.1021/jm0305117
BindingDB Entry DOI: 10.7270/Q2FF3RSP