BDBM50145900 CHEMBL3765050
SMILES: O\C(\C=C\c1ccc(OCc2cc(F)cc(F)c2)cc1)=C/C(=O)/C=C/c1ccc(OCc2cc(F)cc(F)c2)cc1
InChI Key: InChIKey=NELFPAAIIPLLNO-IPARUQOGSA-N
Data: 2 IC50
Activity Spreadsheet -- Enzyme Inhibition Constant Data from BindingDB
Found 2 hits for monomerid = 50145900
Trg + Lig
Ki
nM
ΔG°
kcal/mole
IC50
nM
Kd
nM
EC50/IC50
nM
koff
s-1
kon
M-1s-1
pHTemp
°C
Beta-secretase 1
(Homo sapiens (Human))
BDBM50145900
(CHEMBL3765050)
Show SMILES O\C(\C=C\c1ccc(OCc2cc(F)cc(F)c2)cc1)=C/C(=O)/C=C/c1ccc(OCc2cc(F)cc(F)c2)cc1
Show InChI InChI=1S/C33H24F4O4/c34-26-13-24(14-27(35)17-26)20-40-32-9-3-22(4-10-32)1-7-30(38)19-31(39)8-2-23-5-11-33(12-6-23)41-21-25-15-28(36)18-29(37)16-25/h1-19,38H,20-21H2/b7-1+,8-2+,30-19-
n/an/a 390n/an/an/an/an/an/a
Alma Mater Studiorum - University of Bologna
Curated by ChEMBL
Assay Description
Inhibition of human recombinant BACE1 using M-2420 as substrate preincubated for 1 hr followed by substrate addition incubated for 15 mins by FRET as...
J Med Chem 59: 531-44 (2016)
BindingDB Entry DOI: 10.7270/Q27P9183
Glycogen synthase kinase-3 beta
(Homo sapiens (Human))
BDBM50145900
(CHEMBL3765050)
Show SMILES O\C(\C=C\c1ccc(OCc2cc(F)cc(F)c2)cc1)=C/C(=O)/C=C/c1ccc(OCc2cc(F)cc(F)c2)cc1
Show InChI InChI=1S/C33H24F4O4/c34-26-13-24(14-27(35)17-26)20-40-32-9-3-22(4-10-32)1-7-30(38)19-31(39)8-2-23-5-11-33(12-6-23)41-21-25-15-28(36)18-29(37)16-25/h1-19,38H,20-21H2/b7-1+,8-2+,30-19-
NCI pathway
Reactome pathway
n/an/a 8.30E+3n/an/an/an/an/an/a
Alma Mater Studiorum - University of Bologna
Curated by ChEMBL
Assay Description
Inhibition of human recombinant GSK3-beta using prephosphorylated polypeptide as substrate incubated for 30 mins by Glo-type luminescence assay
J Med Chem 59: 531-44 (2016)
BindingDB Entry DOI: 10.7270/Q27P9183