BDBM50145902 CHEMBL3764532
SMILES: O\C(\C=C\c1ccc(OCc2ccc(F)cc2F)cc1)=C/C(=O)/C=C/c1ccc(OCc2ccc(F)cc2F)cc1
InChI Key: InChIKey=JNJLIKNJRLIHNE-OWFWYVCQSA-N
Data: 2 IC50
Activity Spreadsheet -- Enzyme Inhibition Constant Data from BindingDB
Found 2 hits for monomerid = 50145902
Trg + Lig
Ki
nM
ΔG°
kcal/mole
IC50
nM
Kd
nM
EC50/IC50
nM
koff
s-1
kon
M-1s-1
pHTemp
°C
Beta-secretase 1
(Homo sapiens (Human))
BDBM50145902
(CHEMBL3764532)
Show SMILES O\C(\C=C\c1ccc(OCc2ccc(F)cc2F)cc1)=C/C(=O)/C=C/c1ccc(OCc2ccc(F)cc2F)cc1
Show InChI InChI=1S/C33H24F4O4/c34-26-9-7-24(32(36)17-26)20-40-30-13-3-22(4-14-30)1-11-28(38)19-29(39)12-2-23-5-15-31(16-6-23)41-21-25-8-10-27(35)18-33(25)37/h1-19,38H,20-21H2/b11-1+,12-2+,28-19-
n/an/a 400n/an/an/an/an/an/a
Alma Mater Studiorum - University of Bologna
Curated by ChEMBL
Assay Description
Inhibition of human recombinant BACE1 using M-2420 as substrate preincubated for 1 hr followed by substrate addition incubated for 15 mins by FRET as...
J Med Chem 59: 531-44 (2016)
BindingDB Entry DOI: 10.7270/Q27P9183
Glycogen synthase kinase-3 beta
(Homo sapiens (Human))
BDBM50145902
(CHEMBL3764532)
Show SMILES O\C(\C=C\c1ccc(OCc2ccc(F)cc2F)cc1)=C/C(=O)/C=C/c1ccc(OCc2ccc(F)cc2F)cc1
Show InChI InChI=1S/C33H24F4O4/c34-26-9-7-24(32(36)17-26)20-40-30-13-3-22(4-14-30)1-11-28(38)19-29(39)12-2-23-5-15-31(16-6-23)41-21-25-8-10-27(35)18-33(25)37/h1-19,38H,20-21H2/b11-1+,12-2+,28-19-
NCI pathway
Reactome pathway
n/an/a 9.63E+3n/an/an/an/an/an/a
Alma Mater Studiorum - University of Bologna
Curated by ChEMBL
Assay Description
Inhibition of human recombinant GSK3-beta using prephosphorylated polypeptide as substrate incubated for 30 mins by Glo-type luminescence assay
J Med Chem 59: 531-44 (2016)
BindingDB Entry DOI: 10.7270/Q27P9183