BDBM50145939 CHEMBL3764767
SMILES: COc1ccc(cc1)-c1ccc(CN2CCCN(C)CC2)cc1
InChI Key: InChIKey=QAFOZBNBHRNTBF-UHFFFAOYSA-N
Data: 1 IC50  1 Kd
Activity Spreadsheet -- Enzyme Inhibition Constant Data from BindingDB
Found 2 hits for monomerid = 50145939
Trg + Lig
Ki
nM
ΔG°
kcal/mole
IC50
nM
Kd
nM
EC50/IC50
nM
koff
s-1
kon
M-1s-1
pHTemp
°C
Choline kinase alpha
(Homo sapiens (Human))
BDBM50145939
(CHEMBL3764767)
Show SMILES COc1ccc(cc1)-c1ccc(CN2CCCN(C)CC2)cc1
Show InChI InChI=1S/C20H26N2O/c1-21-12-3-13-22(15-14-21)16-17-4-6-18(7-5-17)19-8-10-20(23-2)11-9-19/h4-11H,3,12-16H2,1-2H3
Reactome pathway
n/an/an/a 3.80E+3n/an/an/an/an/a
ARIAD Pharmaceuticals, Inc.
Curated by ChEMBL
Assay Description
Binding affinity to human N-terminal truncated ChoKalpha1 (75 to 457 residues) by surface plasmon resonance assay
J Med Chem 59: 671-86 (2016)
BindingDB Entry DOI: 10.7270/Q23X88HX
Choline kinase alpha
(Homo sapiens (Human))
BDBM50145939
(CHEMBL3764767)
Show SMILES COc1ccc(cc1)-c1ccc(CN2CCCN(C)CC2)cc1
Show InChI InChI=1S/C20H26N2O/c1-21-12-3-13-22(15-14-21)16-17-4-6-18(7-5-17)19-8-10-20(23-2)11-9-19/h4-11H,3,12-16H2,1-2H3
Reactome pathway
n/an/a 1.43E+3n/an/an/an/an/an/a
ARIAD Pharmaceuticals, Inc.
Curated by ChEMBL
Assay Description
Inhibition of human N-terminal truncated ChoKalpha1 (75 to 457 residues) using choline chloride as substrate measured over 10 to 30 mins by coupled A...
J Med Chem 59: 671-86 (2016)
BindingDB Entry DOI: 10.7270/Q23X88HX