BDBM50146055 5-Methoxy-1,2-dihydro-benzo[f]chromen-3-one::CHEMBL88751
SMILES: COc1cc2ccccc2c2CCC(=O)Oc12
InChI Key: InChIKey=KQMQXDJNDGYRPR-UHFFFAOYSA-N
Data: 1 IC50
Activity Spreadsheet -- Enzyme Inhibition Constant Data from BindingDB
Found 1 hit for monomerid = 50146055
Trg + Lig
Ki
nM
ΔG°
kcal/mole
IC50
nM
Kd
nM
EC50/IC50
nM
koff
s-1
kon
M-1s-1
pHTemp
°C
NAD-dependent histone deacetylase SIR2
(Saccharomyces cerevisiae)
BDBM50146055
(5-Methoxy-1,2-dihydro-benzo[f]chromen-3-one | CHEM...)
Show SMILES COc1cc2ccccc2c2CCC(=O)Oc12
Show InChI InChI=1S/C14H12O3/c1-16-12-8-9-4-2-3-5-10(9)11-6-7-13(15)17-14(11)12/h2-5,8H,6-7H2,1H3
Reactome pathway
n/an/a 1.28E+5n/an/an/an/an/an/a
Fred Hutchinson Cancer Research Center
Curated by ChEMBL
Assay Description
In vitro inhibition of sirtuin 2 was evaluated using yeast whole cell lysates
J Med Chem 47: 2635-44 (2004)
Article DOI: 10.1021/jm030473r
BindingDB Entry DOI: 10.7270/Q228071B