BDBM50146059 3,4-Dihydro-2H-phenanthren-1-one::CHEMBL88130
SMILES: O=C1CCCc2c1ccc1ccccc21
InChI Key: InChIKey=KBARGPSSEIXDQU-UHFFFAOYSA-N
Data: 1 IC50
Activity Spreadsheet -- Enzyme Inhibition Constant Data from BindingDB
Found 1 hit for monomerid = 50146059
Trg + Lig
Ki
nM
ΔG°
kcal/mole
IC50
nM
Kd
nM
EC50/IC50
nM
koff
s-1
kon
M-1s-1
pHTemp
°C
NAD-dependent histone deacetylase SIR2
(Saccharomyces cerevisiae)
BDBM50146059
(3,4-Dihydro-2H-phenanthren-1-one | CHEMBL88130)
Show SMILES O=C1CCCc2c1ccc1ccccc21
Show InChI InChI=1S/C14H12O/c15-14-7-3-6-12-11-5-2-1-4-10(11)8-9-13(12)14/h1-2,4-5,8-9H,3,6-7H2
Reactome pathway
n/an/a 8.10E+4n/an/an/an/an/an/a
Fred Hutchinson Cancer Research Center
Curated by ChEMBL
Assay Description
In vitro inhibition of sirtuin 2 was evaluated using yeast whole cell lysates
J Med Chem 47: 2635-44 (2004)
Article DOI: 10.1021/jm030473r
BindingDB Entry DOI: 10.7270/Q228071B