BDBM50146070 1,2-benzodihydropyrone::2-chromanone::2-hydroxydihydrocinnamic acid lactone::3,4-dihydro-2H-1-benzopyran-2-one::3,4-dihydro-2H-chromen-2-one::3,4-dihydrocoumarin::CHEMBL89306::chroman-2-one::hydrocoumarin::melilotic acid lactone::melilotic lactone::melilotin::melilotol::o-hydroxydihydrocinnamic acid lactone::o-hydroxyhydrocinnamic acid delta-lactone::oxochroman
SMILES: O=C1CCc2ccccc2O1
InChI Key: InChIKey=VMUXSMXIQBNMGZ-UHFFFAOYSA-N
Data: 1 IC50
Activity Spreadsheet -- Enzyme Inhibition Constant Data from BindingDB
Found 1 hit for monomerid = 50146070
Trg + Lig
Ki
nM
ΔG°
kcal/mole
IC50
nM
Kd
nM
EC50/IC50
nM
koff
s-1
kon
M-1s-1
pHTemp
°C
NAD-dependent histone deacetylase SIR2
(Saccharomyces cerevisiae)
BDBM50146070
(1,2-benzodihydropyrone | 2-chromanone | 2-hydroxyd...)
Show SMILES O=C1CCc2ccccc2O1
Show InChI InChI=1S/C9H8O2/c10-9-6-5-7-3-1-2-4-8(7)11-9/h1-4H,5-6H2
Reactome pathway
n/an/a 1.22E+5n/an/an/an/an/an/a
Fred Hutchinson Cancer Research Center
Curated by ChEMBL
Assay Description
In vitro inhibition of sirtuin 2 was evaluated using yeast whole cell lysates
J Med Chem 47: 2635-44 (2004)
Article DOI: 10.1021/jm030473r
BindingDB Entry DOI: 10.7270/Q228071B