BDBM50146160 CHEMBL3765335
SMILES: [H][C@@]1(CC[C@@H](Cc2ccc(NC(=O)[C@H](C)n3ncccc3=O)cc2)N1)[C@H](O)c1ccccc1
InChI Key: InChIKey=PBXGYXYBIGMVQD-KBABAZTHSA-N
Data: 6 IC50  7 EC50
Activity Spreadsheet -- Enzyme Inhibition Constant Data from BindingDB
Found 13 hits for monomerid = 50146160
Trg + Lig
Ki
nM
ΔG°
kcal/mole
IC50
nM
Kd
nM
EC50/IC50
nM
koff
s-1
kon
M-1s-1
pHTemp
°C
Sodium-dependent serotonin transporter
(Homo sapiens (Human))
BDBM50146160
(CHEMBL3765335)
Show SMILES [H][C@@]1(CC[C@@H](Cc2ccc(NC(=O)[C@H](C)n3ncccc3=O)cc2)N1)[C@H](O)c1ccccc1 |r|
Show InChI InChI=1S/C25H28N4O3/c1-17(29-23(30)8-5-15-26-29)25(32)28-20-11-9-18(10-12-20)16-21-13-14-22(27-21)24(31)19-6-3-2-4-7-19/h2-12,15,17,21-22,24,27,31H,13-14,16H2,1H3,(H,28,32)/t17-,21-,22+,24+/m0/s1
n/an/a>1.00E+4n/an/an/an/an/an/a
Merck Research Laboratories
Curated by ChEMBL
Assay Description
Inhibition of human SERT expressed in HEK293 cells preincubated for 30 mins followed by fluorescent substrate addition measured after 30 mins by plat...
J Med Chem 59: 609-23 (2016)
BindingDB Entry DOI: 10.7270/Q2M047B3
Beta-3 adrenergic receptor
(Homo sapiens (Human))
BDBM50146160
(CHEMBL3765335)
Show SMILES [H][C@@]1(CC[C@@H](Cc2ccc(NC(=O)[C@H](C)n3ncccc3=O)cc2)N1)[C@H](O)c1ccccc1 |r|
Show InChI InChI=1S/C25H28N4O3/c1-17(29-23(30)8-5-15-26-29)25(32)28-20-11-9-18(10-12-20)16-21-13-14-22(27-21)24(31)19-6-3-2-4-7-19/h2-12,15,17,21-22,24,27,31H,13-14,16H2,1H3,(H,28,32)/t17-,21-,22+,24+/m0/s1
Reactome pathway
n/an/an/an/a 2.70n/an/an/an/a
Merck Research Laboratories
Curated by ChEMBL
Assay Description
Agonist activity at human beta3 adrenergic receptor expressed in CHO cells assessed as accumulation of cAMP after 30 mins by TR-FRET assay
J Med Chem 59: 609-23 (2016)
BindingDB Entry DOI: 10.7270/Q2M047B3
Beta-1 adrenergic receptor
(Homo sapiens (Human))
BDBM50146160
(CHEMBL3765335)
Show SMILES [H][C@@]1(CC[C@@H](Cc2ccc(NC(=O)[C@H](C)n3ncccc3=O)cc2)N1)[C@H](O)c1ccccc1 |r|
Show InChI InChI=1S/C25H28N4O3/c1-17(29-23(30)8-5-15-26-29)25(32)28-20-11-9-18(10-12-20)16-21-13-14-22(27-21)24(31)19-6-3-2-4-7-19/h2-12,15,17,21-22,24,27,31H,13-14,16H2,1H3,(H,28,32)/t17-,21-,22+,24+/m0/s1
Reactome pathway
n/an/a>2.00E+4n/an/an/an/an/an/a
Merck Research Laboratories
Curated by ChEMBL
Assay Description
Displacement of [125]I-cyanopindolol from recombinant human beta1 adrenergic receptor after 1 hr by scintillation counting method
J Med Chem 59: 609-23 (2016)
BindingDB Entry DOI: 10.7270/Q2M047B3
Beta-2 adrenergic receptor
(Homo sapiens (Human))
BDBM50146160
(CHEMBL3765335)
Show SMILES [H][C@@]1(CC[C@@H](Cc2ccc(NC(=O)[C@H](C)n3ncccc3=O)cc2)N1)[C@H](O)c1ccccc1 |r|
Show InChI InChI=1S/C25H28N4O3/c1-17(29-23(30)8-5-15-26-29)25(32)28-20-11-9-18(10-12-20)16-21-13-14-22(27-21)24(31)19-6-3-2-4-7-19/h2-12,15,17,21-22,24,27,31H,13-14,16H2,1H3,(H,28,32)/t17-,21-,22+,24+/m0/s1
Reactome pathway
n/an/a>2.00E+4n/an/an/an/an/an/a
Merck Research Laboratories
Curated by ChEMBL
Assay Description
Displacement of [125]I-cyanopindolol from human recombinant beta2 adrenergic receptor after 1 hr by scintillation counting method
J Med Chem 59: 609-23 (2016)
BindingDB Entry DOI: 10.7270/Q2M047B3
1,3-beta-glucan synthase component GLS2
(Saccharomyces cerevisiae)
BDBM50146160
(CHEMBL3765335)
Show SMILES [H][C@@]1(CC[C@@H](Cc2ccc(NC(=O)[C@H](C)n3ncccc3=O)cc2)N1)[C@H](O)c1ccccc1 |r|
Show InChI InChI=1S/C25H28N4O3/c1-17(29-23(30)8-5-15-26-29)25(32)28-20-11-9-18(10-12-20)16-21-13-14-22(27-21)24(31)19-6-3-2-4-7-19/h2-12,15,17,21-22,24,27,31H,13-14,16H2,1H3,(H,28,32)/t17-,21-,22+,24+/m0/s1
n/an/a>3.00E+4n/an/an/an/an/an/a
Merck Research Laboratories
Curated by ChEMBL
Assay Description
Binding affinity to human ERG channel
J Med Chem 59: 609-23 (2016)
BindingDB Entry DOI: 10.7270/Q2M047B3
Calcium channel (Type L)
(Homo sapiens (Human))
BDBM50146160
(CHEMBL3765335)
Show SMILES [H][C@@]1(CC[C@@H](Cc2ccc(NC(=O)[C@H](C)n3ncccc3=O)cc2)N1)[C@H](O)c1ccccc1 |r|
Show InChI InChI=1S/C25H28N4O3/c1-17(29-23(30)8-5-15-26-29)25(32)28-20-11-9-18(10-12-20)16-21-13-14-22(27-21)24(31)19-6-3-2-4-7-19/h2-12,15,17,21-22,24,27,31H,13-14,16H2,1H3,(H,28,32)/t17-,21-,22+,24+/m0/s1
n/an/a>3.00E+4n/an/an/an/an/an/a
Merck Research Laboratories
Curated by ChEMBL
Assay Description
Displacement of [3H]-diltiazem from human Cav1.2 channel
J Med Chem 59: 609-23 (2016)
BindingDB Entry DOI: 10.7270/Q2M047B3
Beta-3 adrenergic receptor
(Canis familiaris)
BDBM50146160
(CHEMBL3765335)
Show SMILES [H][C@@]1(CC[C@@H](Cc2ccc(NC(=O)[C@H](C)n3ncccc3=O)cc2)N1)[C@H](O)c1ccccc1 |r|
Show InChI InChI=1S/C25H28N4O3/c1-17(29-23(30)8-5-15-26-29)25(32)28-20-11-9-18(10-12-20)16-21-13-14-22(27-21)24(31)19-6-3-2-4-7-19/h2-12,15,17,21-22,24,27,31H,13-14,16H2,1H3,(H,28,32)/t17-,21-,22+,24+/m0/s1
n/an/an/an/a 39n/an/an/an/a
Merck Research Laboratories
Curated by ChEMBL
Assay Description
Agonist activity at dog beta3 adrenergic receptor expressed in CHO cells assessed as accumulation of cAMP after 30 mins by TR-FRET assay
J Med Chem 59: 609-23 (2016)
BindingDB Entry DOI: 10.7270/Q2M047B3
Adrenergic receptor beta
(Rattus norvegicus)
BDBM50146160
(CHEMBL3765335)
Show SMILES [H][C@@]1(CC[C@@H](Cc2ccc(NC(=O)[C@H](C)n3ncccc3=O)cc2)N1)[C@H](O)c1ccccc1 |r|
Show InChI InChI=1S/C25H28N4O3/c1-17(29-23(30)8-5-15-26-29)25(32)28-20-11-9-18(10-12-20)16-21-13-14-22(27-21)24(31)19-6-3-2-4-7-19/h2-12,15,17,21-22,24,27,31H,13-14,16H2,1H3,(H,28,32)/t17-,21-,22+,24+/m0/s1
Reactome pathway
n/an/an/an/a 531n/an/an/an/a
Merck Research Laboratories
Curated by ChEMBL
Assay Description
Agonist activity at rat beta3 adrenergic receptor expressed in CHO cells assessed as accumulation of cAMP after 30 mins by TR-FRET assay
J Med Chem 59: 609-23 (2016)
BindingDB Entry DOI: 10.7270/Q2M047B3
Beta-3 adrenergic receptor
(Macaca mulatta)
BDBM50146160
(CHEMBL3765335)
Show SMILES [H][C@@]1(CC[C@@H](Cc2ccc(NC(=O)[C@H](C)n3ncccc3=O)cc2)N1)[C@H](O)c1ccccc1 |r|
Show InChI InChI=1S/C25H28N4O3/c1-17(29-23(30)8-5-15-26-29)25(32)28-20-11-9-18(10-12-20)16-21-13-14-22(27-21)24(31)19-6-3-2-4-7-19/h2-12,15,17,21-22,24,27,31H,13-14,16H2,1H3,(H,28,32)/t17-,21-,22+,24+/m0/s1
n/an/an/an/a 2.5n/an/an/an/a
Merck Research Laboratories
Curated by ChEMBL
Assay Description
Agonist activity at rhesus monkey beta3 adrenergic receptor expressed in CHO cells assessed as accumulation of cAMP after 30 mins by TR-FRET assay
J Med Chem 59: 609-23 (2016)
BindingDB Entry DOI: 10.7270/Q2M047B3
Adrenergic receptor beta
(Rattus norvegicus)
BDBM50146160
(CHEMBL3765335)
Show SMILES [H][C@@]1(CC[C@@H](Cc2ccc(NC(=O)[C@H](C)n3ncccc3=O)cc2)N1)[C@H](O)c1ccccc1 |r|
Show InChI InChI=1S/C25H28N4O3/c1-17(29-23(30)8-5-15-26-29)25(32)28-20-11-9-18(10-12-20)16-21-13-14-22(27-21)24(31)19-6-3-2-4-7-19/h2-12,15,17,21-22,24,27,31H,13-14,16H2,1H3,(H,28,32)/t17-,21-,22+,24+/m0/s1
Reactome pathway
n/an/an/an/a 245n/an/an/an/a
Merck Research Laboratories
Curated by ChEMBL
Assay Description
Agonist activity at rat beta3 adrenergic receptor expressed in CHO cells assessed as accumulation of cAMP after 30 mins by TR-FRET assay in presence ...
J Med Chem 59: 609-23 (2016)
BindingDB Entry DOI: 10.7270/Q2M047B3
Beta-3 adrenergic receptor
(Macaca mulatta)
BDBM50146160
(CHEMBL3765335)
Show SMILES [H][C@@]1(CC[C@@H](Cc2ccc(NC(=O)[C@H](C)n3ncccc3=O)cc2)N1)[C@H](O)c1ccccc1 |r|
Show InChI InChI=1S/C25H28N4O3/c1-17(29-23(30)8-5-15-26-29)25(32)28-20-11-9-18(10-12-20)16-21-13-14-22(27-21)24(31)19-6-3-2-4-7-19/h2-12,15,17,21-22,24,27,31H,13-14,16H2,1H3,(H,28,32)/t17-,21-,22+,24+/m0/s1
n/an/an/an/a 12n/an/an/an/a
Merck Research Laboratories
Curated by ChEMBL
Assay Description
Agonist activity at rhesus monkey beta3 adrenergic receptor expressed in CHO cells assessed as accumulation of cAMP after 30 mins by TR-FRET assay in...
J Med Chem 59: 609-23 (2016)
BindingDB Entry DOI: 10.7270/Q2M047B3
Beta-3 adrenergic receptor
(Homo sapiens (Human))
BDBM50146160
(CHEMBL3765335)
Show SMILES [H][C@@]1(CC[C@@H](Cc2ccc(NC(=O)[C@H](C)n3ncccc3=O)cc2)N1)[C@H](O)c1ccccc1 |r|
Show InChI InChI=1S/C25H28N4O3/c1-17(29-23(30)8-5-15-26-29)25(32)28-20-11-9-18(10-12-20)16-21-13-14-22(27-21)24(31)19-6-3-2-4-7-19/h2-12,15,17,21-22,24,27,31H,13-14,16H2,1H3,(H,28,32)/t17-,21-,22+,24+/m0/s1
Reactome pathway
n/an/an/an/a 2.10n/an/an/an/a
Merck Research Laboratories
Curated by ChEMBL
Assay Description
Agonist activity at human adrenergic beta3 receptor expressed in CHO cells assessed as accumulation of cAMP after 30 mins by TR-FRET assay in presenc...
J Med Chem 59: 609-23 (2016)
BindingDB Entry DOI: 10.7270/Q2M047B3
Sodium channel protein type 5 subunit alpha
(Homo sapiens (Human))
BDBM50146160
(CHEMBL3765335)
Show SMILES [H][C@@]1(CC[C@@H](Cc2ccc(NC(=O)[C@H](C)n3ncccc3=O)cc2)N1)[C@H](O)c1ccccc1 |r|
Show InChI InChI=1S/C25H28N4O3/c1-17(29-23(30)8-5-15-26-29)25(32)28-20-11-9-18(10-12-20)16-21-13-14-22(27-21)24(31)19-6-3-2-4-7-19/h2-12,15,17,21-22,24,27,31H,13-14,16H2,1H3,(H,28,32)/t17-,21-,22+,24+/m0/s1
n/an/a>3.00E+4n/an/an/an/an/an/a
Merck Research Laboratories
Curated by ChEMBL
Assay Description
Inhibition of human Nav1.2 channel expressed in Xenopus oocytes by two-intracellular microelectrode voltage clamp method
J Med Chem 59: 609-23 (2016)
BindingDB Entry DOI: 10.7270/Q2M047B3