null
SMILES: Oc1ccc2C(N(CCc2c1)C(=O)C(F)(F)F)c1ccc(Br)cc1
InChI Key: InChIKey=DJRKSGRNONIHEI-UHFFFAOYSA-N
Activity Spreadsheet -- Enzyme Inhibition Constant Data from BindingDB
Found 2 hits for monomerid = 50146204
Trg + Lig
Ki
nM
ΔG°
kcal/mole
IC50
nM
Kd
nM
EC50/IC50
nM
koff
s-1
kon
M-1s-1
pHTemp
°C
Estrogen receptor
(Homo sapiens (Human))
BDBM50146204
(1-[1-(4-Bromo-phenyl)-6-hydroxy-3,4-dihydro-1H-iso...)
Show SMILES Oc1ccc2C(N(CCc2c1)C(=O)C(F)(F)F)c1ccc(Br)cc1
Show InChI InChI=1S/C17H13BrF3NO2/c18-12-3-1-10(2-4-12)15-14-6-5-13(23)9-11(14)7-8-22(15)16(24)17(19,20)21/h1-6,9,15,23H,7-8H2
n/an/a 165n/an/an/an/an/an/a
Pfizer Global Research and Development
Curated by ChEMBL
Assay Description
In vitro concentration required to inhibit [3H]-estradiol binding to human estrogen receptor alpha expressed in 293T cells
Bioorg Med Chem Lett 14: 2729-33 (2004)
Article DOI: 10.1016/j.bmcl.2004.03.077
BindingDB Entry DOI: 10.7270/Q2J67GBK
Estrogen receptor beta
(Homo sapiens (Human))
BDBM50146204
(1-[1-(4-Bromo-phenyl)-6-hydroxy-3,4-dihydro-1H-iso...)
Show SMILES Oc1ccc2C(N(CCc2c1)C(=O)C(F)(F)F)c1ccc(Br)cc1
Show InChI InChI=1S/C17H13BrF3NO2/c18-12-3-1-10(2-4-12)15-14-6-5-13(23)9-11(14)7-8-22(15)16(24)17(19,20)21/h1-6,9,15,23H,7-8H2
n/an/a 22n/an/an/an/an/an/a
Pfizer Global Research and Development
Curated by ChEMBL
Assay Description
In vitro concentration required to inhibit [3H]-estradiol binding to human estrogen receptor beta expressed in 293T cells
Bioorg Med Chem Lett 14: 2729-33 (2004)
Article DOI: 10.1016/j.bmcl.2004.03.077
BindingDB Entry DOI: 10.7270/Q2J67GBK