BDBM50146213 CHEMBL93207::[7-Hydroxy-4-(4-hydroxy-phenyl)-3,4-dihydro-1H-isoquinolin-2-yl]-phenyl-methanone
SMILES: Oc1ccc(cc1)C1CN(Cc2cc(O)ccc12)C(=O)c1ccccc1
InChI Key: InChIKey=TXMWYKYJRAYYNL-UHFFFAOYSA-N
Data: 2 IC50
Activity Spreadsheet -- Enzyme Inhibition Constant Data from BindingDB
Found 2 hits for monomerid = 50146213
Trg + Lig
Ki
nM
ΔG°
kcal/mole
IC50
nM
Kd
nM
EC50/IC50
nM
koff
s-1
kon
M-1s-1
pHTemp
°C
Estrogen receptor
(Homo sapiens (Human))
BDBM50146213
(CHEMBL93207 | [7-Hydroxy-4-(4-hydroxy-phenyl)-3,4-...)
Show SMILES Oc1ccc(cc1)C1CN(Cc2cc(O)ccc12)C(=O)c1ccccc1
Show InChI InChI=1S/C22H19NO3/c24-18-8-6-15(7-9-18)21-14-23(22(26)16-4-2-1-3-5-16)13-17-12-19(25)10-11-20(17)21/h1-12,21,24-25H,13-14H2
n/an/a 160n/an/an/an/an/an/a
Pfizer Global Research and Development
Curated by ChEMBL
Assay Description
In vitro concentration required to inhibit [3H]-estradiol binding to human estrogen receptor alpha expressed in 293T cells
Bioorg Med Chem Lett 14: 2729-33 (2004)
Article DOI: 10.1016/j.bmcl.2004.03.077
BindingDB Entry DOI: 10.7270/Q2J67GBK
Estrogen receptor beta
(Homo sapiens (Human))
BDBM50146213
(CHEMBL93207 | [7-Hydroxy-4-(4-hydroxy-phenyl)-3,4-...)
Show SMILES Oc1ccc(cc1)C1CN(Cc2cc(O)ccc12)C(=O)c1ccccc1
Show InChI InChI=1S/C22H19NO3/c24-18-8-6-15(7-9-18)21-14-23(22(26)16-4-2-1-3-5-16)13-17-12-19(25)10-11-20(17)21/h1-12,21,24-25H,13-14H2
n/an/a 28n/an/an/an/an/an/a
Pfizer Global Research and Development
Curated by ChEMBL
Assay Description
In vitro concentration required to inhibit [3H]-estradiol binding to human estrogen receptor beta expressed in 293T cells
Bioorg Med Chem Lett 14: 2729-33 (2004)
Article DOI: 10.1016/j.bmcl.2004.03.077
BindingDB Entry DOI: 10.7270/Q2J67GBK