null
SMILES: Oc1ccc2C(N(CCc2c1)S(=O)(=O)c1cccc2ccccc12)c1ccc(OCCN2CCCC2)cc1
InChI Key: InChIKey=OEVPCWZBGFRZNA-UHFFFAOYSA-N
Activity Spreadsheet -- Enzyme Inhibition Constant Data from BindingDB
Found 2 hits for monomerid = 50146216
Trg + Lig
Ki
nM
ΔG°
kcal/mole
IC50
nM
Kd
nM
EC50/IC50
nM
koff
s-1
kon
M-1s-1
pHTemp
°C
Estrogen receptor
(Homo sapiens (Human))
BDBM50146216
(2-(Naphthalene-1-sulfonyl)-1-[4-(2-pyrrolidin-1-yl...)
Show SMILES Oc1ccc2C(N(CCc2c1)S(=O)(=O)c1cccc2ccccc12)c1ccc(OCCN2CCCC2)cc1
Show InChI InChI=1S/C31H32N2O4S/c34-26-12-15-29-25(22-26)16-19-33(38(35,36)30-9-5-7-23-6-1-2-8-28(23)30)31(29)24-10-13-27(14-11-24)37-21-20-32-17-3-4-18-32/h1-2,5-15,22,31,34H,3-4,16-21H2
n/an/a 5.60n/an/an/an/an/an/a
Pfizer Global Research and Development
Curated by ChEMBL
Assay Description
In vitro concentration required to inhibit [3H]-estradiol binding to human estrogen receptor alpha expressed in 293T cells
Bioorg Med Chem Lett 14: 2729-33 (2004)
Article DOI: 10.1016/j.bmcl.2004.03.077
BindingDB Entry DOI: 10.7270/Q2J67GBK
Estrogen receptor beta
(Homo sapiens (Human))
BDBM50146216
(2-(Naphthalene-1-sulfonyl)-1-[4-(2-pyrrolidin-1-yl...)
Show SMILES Oc1ccc2C(N(CCc2c1)S(=O)(=O)c1cccc2ccccc12)c1ccc(OCCN2CCCC2)cc1
Show InChI InChI=1S/C31H32N2O4S/c34-26-12-15-29-25(22-26)16-19-33(38(35,36)30-9-5-7-23-6-1-2-8-28(23)30)31(29)24-10-13-27(14-11-24)37-21-20-32-17-3-4-18-32/h1-2,5-15,22,31,34H,3-4,16-21H2
n/an/a 21n/an/an/an/an/an/a
Pfizer Global Research and Development
Curated by ChEMBL
Assay Description
In vitro concentration required to inhibit [3H]-estradiol binding to human estrogen receptor beta expressed in 293T cells
Bioorg Med Chem Lett 14: 2729-33 (2004)
Article DOI: 10.1016/j.bmcl.2004.03.077
BindingDB Entry DOI: 10.7270/Q2J67GBK