null
SMILES: Oc1ccc2C(N(CCc2c1)S(=O)(=O)c1ccc2ccccc2c1)c1ccc(OCCN2CCCC2)cc1
InChI Key: InChIKey=FFWJMJCDPFQUJT-UHFFFAOYSA-N
Activity Spreadsheet -- Enzyme Inhibition Constant Data from BindingDB
Found 2 hits for monomerid = 50146217
Trg + Lig
Ki
nM
ΔG°
kcal/mole
IC50
nM
Kd
nM
EC50/IC50
nM
koff
s-1
kon
M-1s-1
pHTemp
°C
Estrogen receptor beta
(Homo sapiens (Human))
BDBM50146217
(2-(Naphthalene-2-sulfonyl)-1-[4-(2-pyrrolidin-1-yl...)
Show SMILES Oc1ccc2C(N(CCc2c1)S(=O)(=O)c1ccc2ccccc2c1)c1ccc(OCCN2CCCC2)cc1
Show InChI InChI=1S/C31H32N2O4S/c34-27-10-14-30-26(21-27)15-18-33(38(35,36)29-13-9-23-5-1-2-6-25(23)22-29)31(30)24-7-11-28(12-8-24)37-20-19-32-16-3-4-17-32/h1-2,5-14,21-22,31,34H,3-4,15-20H2
n/an/a 1.08E+3n/an/an/an/an/an/a
Pfizer Global Research and Development
Curated by ChEMBL
Assay Description
In vitro concentration required to inhibit [3H]-estradiol binding to human estrogen receptor beta expressed in 293T cells
Bioorg Med Chem Lett 14: 2729-33 (2004)
Article DOI: 10.1016/j.bmcl.2004.03.077
BindingDB Entry DOI: 10.7270/Q2J67GBK
Estrogen receptor
(Homo sapiens (Human))
BDBM50146217
(2-(Naphthalene-2-sulfonyl)-1-[4-(2-pyrrolidin-1-yl...)
Show SMILES Oc1ccc2C(N(CCc2c1)S(=O)(=O)c1ccc2ccccc2c1)c1ccc(OCCN2CCCC2)cc1
Show InChI InChI=1S/C31H32N2O4S/c34-27-10-14-30-26(21-27)15-18-33(38(35,36)29-13-9-23-5-1-2-6-25(23)22-29)31(30)24-7-11-28(12-8-24)37-20-19-32-16-3-4-17-32/h1-2,5-14,21-22,31,34H,3-4,15-20H2
n/an/a 112n/an/an/an/an/an/a
Pfizer Global Research and Development
Curated by ChEMBL
Assay Description
In vitro concentration required to inhibit [3H]-estradiol binding to human estrogen receptor alpha expressed in 293T cells
Bioorg Med Chem Lett 14: 2729-33 (2004)
Article DOI: 10.1016/j.bmcl.2004.03.077
BindingDB Entry DOI: 10.7270/Q2J67GBK