null
SMILES: CCCc1ccc(cc1)S(=O)(=O)N1CCc2cc(O)ccc2C1c1ccc(OCCN2CCCC2)cc1
InChI Key: InChIKey=IBTVWQOYCRXIFM-UHFFFAOYSA-N
Activity Spreadsheet -- Enzyme Inhibition Constant Data from BindingDB
Found 2 hits for monomerid = 50146226
Trg + Lig
Ki
nM
ΔG°
kcal/mole
IC50
nM
Kd
nM
EC50/IC50
nM
koff
s-1
kon
M-1s-1
pHTemp
°C
Estrogen receptor
(Homo sapiens (Human))
BDBM50146226
(2-(4-Propyl-benzenesulfonyl)-1-[4-(2-pyrrolidin-1-...)
Show SMILES CCCc1ccc(cc1)S(=O)(=O)N1CCc2cc(O)ccc2C1c1ccc(OCCN2CCCC2)cc1
Show InChI InChI=1S/C30H36N2O4S/c1-2-5-23-6-13-28(14-7-23)37(34,35)32-19-16-25-22-26(33)10-15-29(25)30(32)24-8-11-27(12-9-24)36-21-20-31-17-3-4-18-31/h6-15,22,30,33H,2-5,16-21H2,1H3
n/an/a 29n/an/an/an/an/an/a
Pfizer Global Research and Development
Curated by ChEMBL
Assay Description
In vitro concentration required to inhibit [3H]-estradiol binding to human estrogen receptor alpha expressed in 293T cells
Bioorg Med Chem Lett 14: 2729-33 (2004)
Article DOI: 10.1016/j.bmcl.2004.03.077
BindingDB Entry DOI: 10.7270/Q2J67GBK
Estrogen receptor beta
(Homo sapiens (Human))
BDBM50146226
(2-(4-Propyl-benzenesulfonyl)-1-[4-(2-pyrrolidin-1-...)
Show SMILES CCCc1ccc(cc1)S(=O)(=O)N1CCc2cc(O)ccc2C1c1ccc(OCCN2CCCC2)cc1
Show InChI InChI=1S/C30H36N2O4S/c1-2-5-23-6-13-28(14-7-23)37(34,35)32-19-16-25-22-26(33)10-15-29(25)30(32)24-8-11-27(12-9-24)36-21-20-31-17-3-4-18-31/h6-15,22,30,33H,2-5,16-21H2,1H3
n/an/a 133n/an/an/an/an/an/a
Pfizer Global Research and Development
Curated by ChEMBL
Assay Description
In vitro concentration required to inhibit [3H]-estradiol binding to human estrogen receptor beta expressed in 293T cells
Bioorg Med Chem Lett 14: 2729-33 (2004)
Article DOI: 10.1016/j.bmcl.2004.03.077
BindingDB Entry DOI: 10.7270/Q2J67GBK