BDBM50146256 (2R,3S)-3-(4-Hydroxy-phenyl)-8-methyl-2-[4-(2-piperidin-1-yl-ethoxy)-phenyl]-2,3-dihydro-benzo[1,4]oxathiin-7-ol::CHEMBL329849
SMILES: Cc1c(O)ccc2S[C@H]([C@H](Oc12)c1ccc(OCCN2CCCCC2)cc1)c1ccc(O)cc1
InChI Key: InChIKey=YZZPBYXZHVCXOL-IZLXSDGUSA-N
Data: 4 IC50
Activity Spreadsheet -- Enzyme Inhibition Constant Data from BindingDB
Found 4 hits for monomerid = 50146256
Trg + Lig
Ki
nM
ΔG°
kcal/mole
IC50
nM
Kd
nM
EC50/IC50
nM
koff
s-1
kon
M-1s-1
pHTemp
°C
Estrogen receptor
(Homo sapiens (Human))
BDBM50146256
((2R,3S)-3-(4-Hydroxy-phenyl)-8-methyl-2-[4-(2-pipe...)
Show SMILES Cc1c(O)ccc2S[C@H]([C@H](Oc12)c1ccc(OCCN2CCCCC2)cc1)c1ccc(O)cc1
Show InChI InChI=1S/C28H31NO4S/c1-19-24(31)13-14-25-26(19)33-27(28(34-25)21-5-9-22(30)10-6-21)20-7-11-23(12-8-20)32-18-17-29-15-3-2-4-16-29/h5-14,27-28,30-31H,2-4,15-18H2,1H3/t27-,28+/m1/s1
n/an/a 9.30n/an/an/an/an/an/a
Merck Research Laboratories
Curated by ChEMBL
Assay Description
Potency in cellular transactivation assay utilizing HEK-293 cells stably co-transfected with human estrogen receptor alpha and the alkaline phosphata...
Bioorg Med Chem Lett 14: 2741-5 (2004)
Article DOI: 10.1016/j.bmcl.2004.03.074
BindingDB Entry DOI: 10.7270/Q28P5ZZ1
Estrogen receptor
(Homo sapiens (Human))
BDBM50146256
((2R,3S)-3-(4-Hydroxy-phenyl)-8-methyl-2-[4-(2-pipe...)
Show SMILES Cc1c(O)ccc2S[C@H]([C@H](Oc12)c1ccc(OCCN2CCCCC2)cc1)c1ccc(O)cc1
Show InChI InChI=1S/C28H31NO4S/c1-19-24(31)13-14-25-26(19)33-27(28(34-25)21-5-9-22(30)10-6-21)20-7-11-23(12-8-20)32-18-17-29-15-3-2-4-16-29/h5-14,27-28,30-31H,2-4,15-18H2,1H3/t27-,28+/m1/s1
n/an/a 1.20n/an/an/an/an/an/a
Merck Research Laboratories
Curated by ChEMBL
Assay Description
Displacement of [3H]-17-beta-estradiol from full length human estrogen receptor alpha
Bioorg Med Chem Lett 14: 2741-5 (2004)
Article DOI: 10.1016/j.bmcl.2004.03.074
BindingDB Entry DOI: 10.7270/Q28P5ZZ1
Estrogen receptor
(Homo sapiens (Human))
BDBM50146256
((2R,3S)-3-(4-Hydroxy-phenyl)-8-methyl-2-[4-(2-pipe...)
Show SMILES Cc1c(O)ccc2S[C@H]([C@H](Oc12)c1ccc(OCCN2CCCCC2)cc1)c1ccc(O)cc1
Show InChI InChI=1S/C28H31NO4S/c1-19-24(31)13-14-25-26(19)33-27(28(34-25)21-5-9-22(30)10-6-21)20-7-11-23(12-8-20)32-18-17-29-15-3-2-4-16-29/h5-14,27-28,30-31H,2-4,15-18H2,1H3/t27-,28+/m1/s1
n/an/a 54n/an/an/an/an/an/a
Merck Research Laboratories
Curated by ChEMBL
Assay Description
Potency in cellular transactivation assay utilizing HEK-293 cells stably co-transfected with human estrogen receptor beta and the alkaline phosphatas...
Bioorg Med Chem Lett 14: 2741-5 (2004)
Article DOI: 10.1016/j.bmcl.2004.03.074
BindingDB Entry DOI: 10.7270/Q28P5ZZ1
Estradiol receptor beta (ERβ)
(Homo sapiens (Human))
BDBM50146256
((2R,3S)-3-(4-Hydroxy-phenyl)-8-methyl-2-[4-(2-pipe...)
Show SMILES Cc1c(O)ccc2S[C@H]([C@H](Oc12)c1ccc(OCCN2CCCCC2)cc1)c1ccc(O)cc1
Show InChI InChI=1S/C28H31NO4S/c1-19-24(31)13-14-25-26(19)33-27(28(34-25)21-5-9-22(30)10-6-21)20-7-11-23(12-8-20)32-18-17-29-15-3-2-4-16-29/h5-14,27-28,30-31H,2-4,15-18H2,1H3/t27-,28+/m1/s1
n/an/a 68n/an/an/an/an/an/a
Merck Research Laboratories
Curated by ChEMBL
Assay Description
Potency in cellular transactivation assay utilizing HEK-293 cells stably co-transfected with human estrogen receptor beta and the alkaline phosphatas...
Bioorg Med Chem Lett 14: 2741-5 (2004)
Article DOI: 10.1016/j.bmcl.2004.03.074
BindingDB Entry DOI: 10.7270/Q28P5ZZ1