BDBM50146270 (2S,3R)-3-(3-Hydroxy-phenyl)-2-[4-(2-piperidin-1-yl-ethoxy)-phenyl]-2,3-dihydro-benzo[1,4]oxathiin-6-ol::CHEMBL93705
SMILES: Oc1cccc(c1)[C@H]1Sc2cc(O)ccc2O[C@H]1c1ccc(OCCN2CCCCC2)cc1
InChI Key: InChIKey=NAULYXADLNIEES-RRPNLBNLSA-N
Data: 6 IC50
Activity Spreadsheet -- Enzyme Inhibition Constant Data from BindingDB
Found 6 hits for monomerid = 50146270
Trg + Lig
Ki
nM
ΔG°
kcal/mole
IC50
nM
Kd
nM
EC50/IC50
nM
koff
s-1
kon
M-1s-1
pHTemp
°C
Estrogen receptor
(Homo sapiens (Human))
BDBM50146270
((2S,3R)-3-(3-Hydroxy-phenyl)-2-[4-(2-piperidin-1-y...)
Show SMILES Oc1cccc(c1)[C@H]1Sc2cc(O)ccc2O[C@H]1c1ccc(OCCN2CCCCC2)cc1
Show InChI InChI=1S/C27H29NO4S/c29-21-6-4-5-20(17-21)27-26(32-24-12-9-22(30)18-25(24)33-27)19-7-10-23(11-8-19)31-16-15-28-13-2-1-3-14-28/h4-12,17-18,26-27,29-30H,1-3,13-16H2/t26-,27+/m0/s1
n/an/a 4.10n/an/an/an/an/an/a
Merck Research Laboratories
Curated by ChEMBL
Assay Description
Displacement of [3H]-17-beta-estradiol from full length human estrogen receptor alpha
Bioorg Med Chem Lett 14: 2741-5 (2004)
Article DOI: 10.1016/j.bmcl.2004.03.074
BindingDB Entry DOI: 10.7270/Q28P5ZZ1
Estradiol receptor beta (ERβ)
(Homo sapiens (Human))
BDBM50146270
((2S,3R)-3-(3-Hydroxy-phenyl)-2-[4-(2-piperidin-1-y...)
Show SMILES Oc1cccc(c1)[C@H]1Sc2cc(O)ccc2O[C@H]1c1ccc(OCCN2CCCCC2)cc1
Show InChI InChI=1S/C27H29NO4S/c29-21-6-4-5-20(17-21)27-26(32-24-12-9-22(30)18-25(24)33-27)19-7-10-23(11-8-19)31-16-15-28-13-2-1-3-14-28/h4-12,17-18,26-27,29-30H,1-3,13-16H2/t26-,27+/m0/s1
n/an/a 115n/an/an/an/an/an/a
Merck Research Laboratories
Curated by ChEMBL
Assay Description
Displacement of [3H]-17-beta-estradiol from full length human estrogen receptor beta
Bioorg Med Chem Lett 14: 2741-5 (2004)
Article DOI: 10.1016/j.bmcl.2004.03.074
BindingDB Entry DOI: 10.7270/Q28P5ZZ1
Estrogen receptor
(Homo sapiens (Human))
BDBM50146270
((2S,3R)-3-(3-Hydroxy-phenyl)-2-[4-(2-piperidin-1-y...)
Show SMILES Oc1cccc(c1)[C@H]1Sc2cc(O)ccc2O[C@H]1c1ccc(OCCN2CCCCC2)cc1
Show InChI InChI=1S/C27H29NO4S/c29-21-6-4-5-20(17-21)27-26(32-24-12-9-22(30)18-25(24)33-27)19-7-10-23(11-8-19)31-16-15-28-13-2-1-3-14-28/h4-12,17-18,26-27,29-30H,1-3,13-16H2/t26-,27+/m0/s1
n/an/a 5.40n/an/an/an/an/an/a
Merck Research Laboratories
Curated by ChEMBL
Assay Description
Displacement of [3H]-17-beta-estradiol from full length human estrogen receptor alpha
Bioorg Med Chem Lett 14: 2741-5 (2004)
Article DOI: 10.1016/j.bmcl.2004.03.074
BindingDB Entry DOI: 10.7270/Q28P5ZZ1
Estrogen receptor
(Homo sapiens (Human))
BDBM50146270
((2S,3R)-3-(3-Hydroxy-phenyl)-2-[4-(2-piperidin-1-y...)
Show SMILES Oc1cccc(c1)[C@H]1Sc2cc(O)ccc2O[C@H]1c1ccc(OCCN2CCCCC2)cc1
Show InChI InChI=1S/C27H29NO4S/c29-21-6-4-5-20(17-21)27-26(32-24-12-9-22(30)18-25(24)33-27)19-7-10-23(11-8-19)31-16-15-28-13-2-1-3-14-28/h4-12,17-18,26-27,29-30H,1-3,13-16H2/t26-,27+/m0/s1
n/an/a 4n/an/an/an/an/an/a
Merck Research Laboratories
Curated by ChEMBL
Assay Description
Binding affinity for human estrogen receptor alpha
Bioorg Med Chem Lett 14: 3753-5 (2004)
Article DOI: 10.1016/j.bmcl.2004.04.101
BindingDB Entry DOI: 10.7270/Q29886GZ
Estrogen receptor
(Homo sapiens (Human))
BDBM50146270
((2S,3R)-3-(3-Hydroxy-phenyl)-2-[4-(2-piperidin-1-y...)
Show SMILES Oc1cccc(c1)[C@H]1Sc2cc(O)ccc2O[C@H]1c1ccc(OCCN2CCCCC2)cc1
Show InChI InChI=1S/C27H29NO4S/c29-21-6-4-5-20(17-21)27-26(32-24-12-9-22(30)18-25(24)33-27)19-7-10-23(11-8-19)31-16-15-28-13-2-1-3-14-28/h4-12,17-18,26-27,29-30H,1-3,13-16H2/t26-,27+/m0/s1
n/an/a 157n/an/an/an/an/an/a
Merck Research Laboratories
Curated by ChEMBL
Assay Description
Potency in cellular transactivation assay utilizing HEK-293 cells stably co-transfected with human estrogen receptor beta and the alkaline phosphatas...
Bioorg Med Chem Lett 14: 2741-5 (2004)
Article DOI: 10.1016/j.bmcl.2004.03.074
BindingDB Entry DOI: 10.7270/Q28P5ZZ1
Estradiol receptor beta (ERβ)
(Homo sapiens (Human))
BDBM50146270
((2S,3R)-3-(3-Hydroxy-phenyl)-2-[4-(2-piperidin-1-y...)
Show SMILES Oc1cccc(c1)[C@H]1Sc2cc(O)ccc2O[C@H]1c1ccc(OCCN2CCCCC2)cc1
Show InChI InChI=1S/C27H29NO4S/c29-21-6-4-5-20(17-21)27-26(32-24-12-9-22(30)18-25(24)33-27)19-7-10-23(11-8-19)31-16-15-28-13-2-1-3-14-28/h4-12,17-18,26-27,29-30H,1-3,13-16H2/t26-,27+/m0/s1
n/an/a 115n/an/an/an/an/an/a
Merck Research Laboratories
Curated by ChEMBL
Assay Description
Binding affinity for human estrogen receptor beta
Bioorg Med Chem Lett 14: 3753-5 (2004)
Article DOI: 10.1016/j.bmcl.2004.04.101
BindingDB Entry DOI: 10.7270/Q29886GZ