BDBM50146310 Biphenyl-2-carboxylic acid [4-((S)-3,4,11,11a-tetrahydro-1H,5H-2-oxa-4a,10-diaza-dibenzo[a,d]cycloheptene-10-carbonyl)-phenyl]-amide::CHEMBL93861
SMILES: O=C(Nc1ccc(cc1)C(=O)N1C[C@H]2COCCN2Cc2ccccc12)c1ccccc1-c1ccccc1
InChI Key: InChIKey=QJBNZULODBFWMG-MHZLTWQESA-N
Data: 2 KI
Activity Spreadsheet -- Enzyme Inhibition Constant Data from BindingDB
Found 2 hits for monomerid = 50146310
Trg + Lig
Ki
nM
ΔG°
kcal/mole
IC50
nM
Kd
nM
EC50/IC50
nM
koff
s-1
kon
M-1s-1
pHTemp
°C
Vasopressin V2 receptor
(Homo sapiens (Human))
BDBM50146310
(Biphenyl-2-carboxylic acid [4-((S)-3,4,11,11a-tetr...)
Show SMILES O=C(Nc1ccc(cc1)C(=O)N1C[C@H]2COCCN2Cc2ccccc12)c1ccccc1-c1ccccc1
Show InChI InChI=1S/C32H29N3O3/c36-31(29-12-6-5-11-28(29)23-8-2-1-3-9-23)33-26-16-14-24(15-17-26)32(37)35-21-27-22-38-19-18-34(27)20-25-10-4-7-13-30(25)35/h1-17,27H,18-22H2,(H,33,36)/t27-/m0/s1
3.70n/an/an/an/an/an/an/an/a
Johnson& Johnson Pharmaceutical Research& Development
Curated by ChEMBL
Assay Description
Inhibition of [3H]AVP binding to recombinant human vasopressin V2 receptor
Bioorg Med Chem Lett 14: 2747-52 (2004)
Article DOI: 10.1016/j.bmcl.2004.03.083
BindingDB Entry DOI: 10.7270/Q2QN679W
Vasopressin V2 receptor
(Homo sapiens (Human))
BDBM50146310
(Biphenyl-2-carboxylic acid [4-((S)-3,4,11,11a-tetr...)
Show SMILES O=C(Nc1ccc(cc1)C(=O)N1C[C@H]2COCCN2Cc2ccccc12)c1ccccc1-c1ccccc1
Show InChI InChI=1S/C32H29N3O3/c36-31(29-12-6-5-11-28(29)23-8-2-1-3-9-23)33-26-16-14-24(15-17-26)32(37)35-21-27-22-38-19-18-34(27)20-25-10-4-7-13-30(25)35/h1-17,27H,18-22H2,(H,33,36)/t27-/m0/s1
16n/an/an/an/an/an/an/an/a
Johnson& Johnson Pharmaceutical Research& Development
Curated by ChEMBL
Assay Description
Inhibition of 1 nM AVP-induced cAMP accumulation in cells expressing human vasopressin V2 receptor
Bioorg Med Chem Lett 14: 2747-52 (2004)
Article DOI: 10.1016/j.bmcl.2004.03.083
BindingDB Entry DOI: 10.7270/Q2QN679W