BDBM50146384 CHEMBL314328::N-Phenethyl-2-(toluene-4-sulfonylamino)-benzamide
SMILES: Cc1ccc(cc1)S(=O)(=O)Nc1ccccc1C(=O)NCCc1ccccc1
InChI Key: InChIKey=QLFGNZRFLMFTDF-UHFFFAOYSA-N
Data: 1 IC50
Activity Spreadsheet -- Enzyme Inhibition Constant Data from BindingDB
Found 1 hit for monomerid = 50146384
Trg + Lig
Ki
nM
ΔG°
kcal/mole
IC50
nM
Kd
nM
EC50/IC50
nM
koff
s-1
kon
M-1s-1
pHTemp
°C
Voltage-gated potassium channel subunit Kv1.5
(Homo sapiens (Human))
BDBM50146384
(CHEMBL314328 | N-Phenethyl-2-(toluene-4-sulfonylam...)
Show SMILES Cc1ccc(cc1)S(=O)(=O)Nc1ccccc1C(=O)NCCc1ccccc1
Show InChI InChI=1S/C22H22N2O3S/c1-17-11-13-19(14-12-17)28(26,27)24-21-10-6-5-9-20(21)22(25)23-16-15-18-7-3-2-4-8-18/h2-14,24H,15-16H2,1H3,(H,23,25)
n/an/a 6.70E+3n/an/an/an/an/an/a
Aventis Pharma Deutschland GmbH
Curated by ChEMBL
Assay Description
Inhibitory effect against human voltage-gated potassium channel subunit Kv1.5 expressed in Xenopus oocytes
Bioorg Med Chem Lett 14: 2823-7 (2004)
Article DOI: 10.1016/j.bmcl.2004.03.057
BindingDB Entry DOI: 10.7270/Q2RR1XPJ