BDBM50146469 CHEMBL319782::N-Hydroxy-N-[2-[4-(2-methyl-quinolin-4-ylmethoxy)-benzenesulfonyl]-1-(4-oxo-cyclohexyl)-ethyl]-formamide
SMILES: Cc1cc(COc2ccc(cc2)S(=O)(=O)CC(C2CCC(=O)CC2)N(O)C=O)c2ccccc2n1
InChI Key: InChIKey=QBIHWFSRXVWUDN-UHFFFAOYSA-N
Data: 6 IC50
Activity Spreadsheet -- Enzyme Inhibition Constant Data from BindingDB
Found 6 hits for monomerid = 50146469
Trg + Lig
Ki
nM
ΔG°
kcal/mole
IC50
nM
Kd
nM
EC50/IC50
nM
koff
s-1
kon
M-1s-1
pHTemp
°C
Matrix metalloproteinase-9
(Homo sapiens (Human))
BDBM50146469
(CHEMBL319782 | N-Hydroxy-N-[2-[4-(2-methyl-quinoli...)
Show SMILES Cc1cc(COc2ccc(cc2)S(=O)(=O)CC(C2CCC(=O)CC2)N(O)C=O)c2ccccc2n1
Show InChI InChI=1S/C26H28N2O6S/c1-18-14-20(24-4-2-3-5-25(24)27-18)15-34-22-10-12-23(13-11-22)35(32,33)16-26(28(31)17-29)19-6-8-21(30)9-7-19/h2-5,10-14,17,19,26,31H,6-9,15-16H2,1H3
Reactome pathway
n/an/a 2.80E+4n/an/an/an/an/an/a
Kaken Pharmaceutical Co., Ltd
Curated by ChEMBL
Assay Description
Inhibition of matrix metalloproteinase-9
Bioorg Med Chem Lett 14: 2897-900 (2004)
Article DOI: 10.1016/j.bmcl.2004.03.048
BindingDB Entry DOI: 10.7270/Q27S7N7C
Matrix metalloproteinase 17
(Homo sapiens (Human))
BDBM50146469
(CHEMBL319782 | N-Hydroxy-N-[2-[4-(2-methyl-quinoli...)
Show SMILES Cc1cc(COc2ccc(cc2)S(=O)(=O)CC(C2CCC(=O)CC2)N(O)C=O)c2ccccc2n1
Show InChI InChI=1S/C26H28N2O6S/c1-18-14-20(24-4-2-3-5-25(24)27-18)15-34-22-10-12-23(13-11-22)35(32,33)16-26(28(31)17-29)19-6-8-21(30)9-7-19/h2-5,10-14,17,19,26,31H,6-9,15-16H2,1H3
n/an/a 600n/an/an/an/an/an/a
Kaken Pharmaceutical Co., Ltd
Curated by ChEMBL
Assay Description
Inhibition of matrix metalloproteinase-17
Bioorg Med Chem Lett 14: 2897-900 (2004)
Article DOI: 10.1016/j.bmcl.2004.03.048
BindingDB Entry DOI: 10.7270/Q27S7N7C
Stromelysin-1
(Homo sapiens (Human))
BDBM50146469
(CHEMBL319782 | N-Hydroxy-N-[2-[4-(2-methyl-quinoli...)
Show SMILES Cc1cc(COc2ccc(cc2)S(=O)(=O)CC(C2CCC(=O)CC2)N(O)C=O)c2ccccc2n1
Show InChI InChI=1S/C26H28N2O6S/c1-18-14-20(24-4-2-3-5-25(24)27-18)15-34-22-10-12-23(13-11-22)35(32,33)16-26(28(31)17-29)19-6-8-21(30)9-7-19/h2-5,10-14,17,19,26,31H,6-9,15-16H2,1H3
Reactome pathway
n/an/a 2.00E+3n/an/an/an/an/an/a
Kaken Pharmaceutical Co., Ltd
Curated by ChEMBL
Assay Description
Inhibition of matrix metalloproteinase-3
Bioorg Med Chem Lett 14: 2897-900 (2004)
Article DOI: 10.1016/j.bmcl.2004.03.048
BindingDB Entry DOI: 10.7270/Q27S7N7C
Disintegrin and metalloproteinase domain-containing protein 17
(Homo sapiens (Human))
BDBM50146469
(CHEMBL319782 | N-Hydroxy-N-[2-[4-(2-methyl-quinoli...)
Show SMILES Cc1cc(COc2ccc(cc2)S(=O)(=O)CC(C2CCC(=O)CC2)N(O)C=O)c2ccccc2n1
Show InChI InChI=1S/C26H28N2O6S/c1-18-14-20(24-4-2-3-5-25(24)27-18)15-34-22-10-12-23(13-11-22)35(32,33)16-26(28(31)17-29)19-6-8-21(30)9-7-19/h2-5,10-14,17,19,26,31H,6-9,15-16H2,1H3
Reactome pathway
n/an/a 20n/an/an/an/an/an/a
Kaken Pharmaceutical Co., Ltd
Curated by ChEMBL
Assay Description
Inhibition of Tumor necrosis factor alpha converting enzyme
Bioorg Med Chem Lett 14: 2897-900 (2004)
Article DOI: 10.1016/j.bmcl.2004.03.048
BindingDB Entry DOI: 10.7270/Q27S7N7C
Collagenase 3
(Homo sapiens (Human))
BDBM50146469
(CHEMBL319782 | N-Hydroxy-N-[2-[4-(2-methyl-quinoli...)
Show SMILES Cc1cc(COc2ccc(cc2)S(=O)(=O)CC(C2CCC(=O)CC2)N(O)C=O)c2ccccc2n1
Show InChI InChI=1S/C26H28N2O6S/c1-18-14-20(24-4-2-3-5-25(24)27-18)15-34-22-10-12-23(13-11-22)35(32,33)16-26(28(31)17-29)19-6-8-21(30)9-7-19/h2-5,10-14,17,19,26,31H,6-9,15-16H2,1H3
NCI pathway
Reactome pathway
n/an/a 7.00E+3n/an/an/an/an/an/a
Kaken Pharmaceutical Co., Ltd
Curated by ChEMBL
Assay Description
Inhibition of matrix metalloproteinase-13
Bioorg Med Chem Lett 14: 2897-900 (2004)
Article DOI: 10.1016/j.bmcl.2004.03.048
BindingDB Entry DOI: 10.7270/Q27S7N7C
72 kDa type IV collagenase
(Homo sapiens (Human))
BDBM50146469
(CHEMBL319782 | N-Hydroxy-N-[2-[4-(2-methyl-quinoli...)
Show SMILES Cc1cc(COc2ccc(cc2)S(=O)(=O)CC(C2CCC(=O)CC2)N(O)C=O)c2ccccc2n1
Show InChI InChI=1S/C26H28N2O6S/c1-18-14-20(24-4-2-3-5-25(24)27-18)15-34-22-10-12-23(13-11-22)35(32,33)16-26(28(31)17-29)19-6-8-21(30)9-7-19/h2-5,10-14,17,19,26,31H,6-9,15-16H2,1H3
Reactome pathway
n/an/a 3.00E+4n/an/an/an/an/an/a
Kaken Pharmaceutical Co., Ltd
Curated by ChEMBL
Assay Description
Inhibition of matrix metalloproteinase-2
Bioorg Med Chem Lett 14: 2897-900 (2004)
Article DOI: 10.1016/j.bmcl.2004.03.048
BindingDB Entry DOI: 10.7270/Q27S7N7C