BDBM50146521 CHEMBL3764703
SMILES: Cl.NOCc1ccc(Cl)cc1Cl
InChI Key: InChIKey=HFZNWDNDGDEBBV-UHFFFAOYSA-N
Data: 1 IC50
Activity Spreadsheet -- Enzyme Inhibition Constant Data from BindingDB
Found 1 hit for monomerid = 50146521
Trg + Lig
Ki
nM
ΔG°
kcal/mole
IC50
nM
Kd
nM
EC50/IC50
nM
koff
s-1
kon
M-1s-1
pHTemp
°C
Indoleamine 2,3-dioxygenase
(Homo sapiens (Human))
BDBM50146521
(CHEMBL3764703)
Show SMILES Cl.NOCc1ccc(Cl)cc1Cl
Show InChI InChI=1S/C7H7Cl2NO.ClH/c8-6-2-1-5(4-11-10)7(9)3-6;/h1-3H,4,10H2;1H
Reactome pathway
n/an/a 630n/an/an/an/an/an/a
Bryn Mawr College
Curated by ChEMBL
Assay Description
Inhibition of recombinant human IDO1 assessed as reduction in kynurenine production using L-tryptophan as substrate after 60 mins by microplate reade...
Eur J Med Chem 108: 564-76 (2016)
BindingDB Entry DOI: 10.7270/Q26Q203T