BDBM50146525 CHEMBL3765142
SMILES: Cl.NOCc1ccccc1Cl
InChI Key: InChIKey=GZKKABCYIDGALV-UHFFFAOYSA-N
Data: 1 IC50
Activity Spreadsheet -- Enzyme Inhibition Constant Data from BindingDB
Found 1 hit for monomerid = 50146525
Trg + Lig
Ki
nM
ΔG°
kcal/mole
IC50
nM
Kd
nM
EC50/IC50
nM
koff
s-1
kon
M-1s-1
pHTemp
°C
Indoleamine 2,3-dioxygenase
(Homo sapiens (Human))
BDBM50146525
(CHEMBL3765142)
Show SMILES Cl.NOCc1ccccc1Cl
Show InChI InChI=1S/C7H8ClNO.ClH/c8-7-4-2-1-3-6(7)5-10-9;/h1-4H,5,9H2;1H
Reactome pathway
n/an/a 630n/an/an/an/an/an/a
Bryn Mawr College
Curated by ChEMBL
Assay Description
Inhibition of recombinant human IDO1 assessed as reduction in kynurenine production using L-tryptophan as substrate after 60 mins by microplate reade...
Eur J Med Chem 108: 564-76 (2016)
BindingDB Entry DOI: 10.7270/Q26Q203T