BDBM50146546 CHEMBL3764152
SMILES: Cl.Cc1cccc(CON)c1
InChI Key: InChIKey=FWNKECQDCMNQMU-UHFFFAOYSA-N
Data: 1 IC50
Activity Spreadsheet -- Enzyme Inhibition Constant Data from BindingDB
Found 1 hit for monomerid = 50146546
Trg + Lig
Ki
nM
ΔG°
kcal/mole
IC50
nM
Kd
nM
EC50/IC50
nM
koff
s-1
kon
M-1s-1
pHTemp
°C
Indoleamine 2,3-dioxygenase
(Homo sapiens (Human))
BDBM50146546
(CHEMBL3764152)
Show SMILES Cl.Cc1cccc(CON)c1
Show InChI InChI=1S/C8H11NO.ClH/c1-7-3-2-4-8(5-7)6-10-9;/h2-5H,6,9H2,1H3;1H
Reactome pathway
n/an/a 2.70E+3n/an/an/an/an/an/a
Bryn Mawr College
Curated by ChEMBL
Assay Description
Inhibition of recombinant human IDO1 assessed as reduction in kynurenine production using L-tryptophan as substrate after 60 mins by microplate reade...
Eur J Med Chem 108: 564-76 (2016)
BindingDB Entry DOI: 10.7270/Q26Q203T