BDBM50146548 CHEMBL3764903
SMILES: Cl.NOCc1ccc(cc1)C(F)(F)F
InChI Key: InChIKey=XLFMFCSFMQLFAY-UHFFFAOYSA-N
Data: 1 IC50
Activity Spreadsheet -- Enzyme Inhibition Constant Data from BindingDB
Found 1 hit for monomerid = 50146548
Trg + Lig
Ki
nM
ΔG°
kcal/mole
IC50
nM
Kd
nM
EC50/IC50
nM
koff
s-1
kon
M-1s-1
pHTemp
°C
Indoleamine 2,3-dioxygenase
(Homo sapiens (Human))
BDBM50146548
(CHEMBL3764903)
Show SMILES Cl.NOCc1ccc(cc1)C(F)(F)F
Show InChI InChI=1S/C8H8F3NO.ClH/c9-8(10,11)7-3-1-6(2-4-7)5-13-12;/h1-4H,5,12H2;1H
Reactome pathway
n/an/a 8.90E+3n/an/an/an/an/an/a
Bryn Mawr College
Curated by ChEMBL
Assay Description
Inhibition of recombinant human IDO1 assessed as reduction in kynurenine production using L-tryptophan as substrate after 60 mins by microplate reade...
Eur J Med Chem 108: 564-76 (2016)
BindingDB Entry DOI: 10.7270/Q26Q203T