BDBM50146549 CHEMBL3764222
SMILES: Cl.COc1cccc(CON)c1
InChI Key: InChIKey=DNGAZMVOQCQJIG-UHFFFAOYSA-N
Data: 1 IC50
Activity Spreadsheet -- Enzyme Inhibition Constant Data from BindingDB
Found 1 hit for monomerid = 50146549
Trg + Lig
Ki
nM
ΔG°
kcal/mole
IC50
nM
Kd
nM
EC50/IC50
nM
koff
s-1
kon
M-1s-1
pHTemp
°C
Indoleamine 2,3-dioxygenase
(Homo sapiens (Human))
BDBM50146549
(CHEMBL3764222)
Show SMILES Cl.COc1cccc(CON)c1
Show InChI InChI=1S/C8H11NO2.ClH/c1-10-8-4-2-3-7(5-8)6-11-9;/h2-5H,6,9H2,1H3;1H
Reactome pathway
n/an/a 9.50E+3n/an/an/an/an/an/a
Bryn Mawr College
Curated by ChEMBL
Assay Description
Inhibition of recombinant human IDO1 assessed as reduction in kynurenine production using L-tryptophan as substrate after 60 mins by microplate reade...
Eur J Med Chem 108: 564-76 (2016)
BindingDB Entry DOI: 10.7270/Q26Q203T