BDBM50146579 Benzyl-O-Hydroxylamine::CHEMBL443652::O-Benzylhydroxylamine
SMILES: NOCc1ccccc1
InChI Key: InChIKey=XYEOALKITRFCJJ-UHFFFAOYSA-N
Data: 2 IC50
PDB links: 1 PDB ID matches this monomer.
Activity Spreadsheet -- Enzyme Inhibition Constant Data from BindingDB
Found 2 hits for monomerid = 50146579
Trg + Lig
Ki
nM
ΔG°
kcal/mole
IC50
nM
Kd
nM
EC50/IC50
nM
koff
s-1
kon
M-1s-1
pHTemp
°C
Indoleamine 2,3-dioxygenase
(Homo sapiens (Human))
BDBM50146579
(Benzyl-O-Hydroxylamine | CHEMBL443652 | O-Benzylhy...)
Show SMILES NOCc1ccccc1
Show InChI InChI=1S/C7H9NO/c8-9-6-7-4-2-1-3-5-7/h1-5H,6,8H2
Reactome pathway
n/an/a<1.00E+4n/an/an/an/an/an/a
SIB Swiss Institute of Bioinformatics
Curated by ChEMBL
Assay Description
Inhibition of human IDO using L-tryptophan as substrate preincubated for 5 mins followed by substrate addition measured after 15 mins by spectrophoto...
J Med Chem 58: 9421-37 (2015)
Article DOI: 10.1021/acs.jmedchem.5b00326
BindingDB Entry DOI: 10.7270/Q28K7D3X
Indoleamine 2,3-dioxygenase
(Homo sapiens (Human))
BDBM50146579
(Benzyl-O-Hydroxylamine | CHEMBL443652 | O-Benzylhy...)
Show SMILES NOCc1ccccc1
Show InChI InChI=1S/C7H9NO/c8-9-6-7-4-2-1-3-5-7/h1-5H,6,8H2
Reactome pathway
n/an/a 810n/an/an/an/an/an/a
Bryn Mawr College
Curated by ChEMBL
Assay Description
Inhibition of recombinant human IDO1 assessed as reduction in kynurenine production using L-tryptophan as substrate after 60 mins by microplate reade...
Eur J Med Chem 108: 564-76 (2016)
BindingDB Entry DOI: 10.7270/Q26Q203T