BDBM50146598 CHEMBL3764647
SMILES: CNc1ccccc1C(=O)NCCn1ccc(=O)[nH]c1=O
InChI Key: InChIKey=KBGZUKXZFDPDRE-UHFFFAOYSA-N
Data: 2 Kd
Activity Spreadsheet -- Enzyme Inhibition Constant Data from BindingDB
Found 2 hits for monomerid = 50146598
Trg + Lig
Ki
nM
ΔG°
kcal/mole
IC50
nM
Kd
nM
EC50/IC50
nM
koff
s-1
kon
M-1s-1
pHTemp
°C
Protein cereblon
(Homo sapiens (Human))
BDBM50146598
(CHEMBL3764647)
Show SMILES CNc1ccccc1C(=O)NCCn1ccc(=O)[nH]c1=O
Show InChI InChI=1S/C14H16N4O3/c1-15-11-5-3-2-4-10(11)13(20)16-7-9-18-8-6-12(19)17-14(18)21/h2-6,8,15H,7,9H2,1H3,(H,16,20)(H,17,19,21)
n/an/an/a 7.90E+3n/an/an/an/an/a
Max Planck Institute for Developmental Biology
Curated by ChEMBL
Assay Description
Binding affinity to human CRBN (delta 1 to 315) by FRET assay
J Med Chem 59: 770-4 (2016)
BindingDB Entry DOI: 10.7270/Q2PR7XVF
Cereblon isoform 4
(Magnetospirillum gryphiswaldense)
BDBM50146598
(CHEMBL3764647)
Show SMILES CNc1ccccc1C(=O)NCCn1ccc(=O)[nH]c1=O
Show InChI InChI=1S/C14H16N4O3/c1-15-11-5-3-2-4-10(11)13(20)16-7-9-18-8-6-12(19)17-14(18)21/h2-6,8,15H,7,9H2,1H3,(H,16,20)(H,17,19,21)
n/an/an/a 3.30E+3n/an/an/an/an/a
Max Planck Institute for Developmental Biology
Curated by ChEMBL
Assay Description
Binding affinity to wild type Magnetospirillum gryphiswaldense cereblon isoform 4 by FRET assay
J Med Chem 59: 770-4 (2016)
BindingDB Entry DOI: 10.7270/Q2PR7XVF