BDBM50146743 (S)-(4,6-Dimethyl-pyrimidin-2-yloxy)-[(S)-2-oxo-5-phenyl-1-(2,3,6-trifluoro-benzyl)-2,3,4,5-tetrahydro-1H-benzo[e][1,4]diazepin-5-yl]-acetic acid::CHEMBL94580
SMILES: Cc1cc(C)nc(O[C@H](C(O)=O)[C@]2(NCC(=O)N(Cc3c(F)ccc(F)c3F)c3ccccc23)c2ccccc2)n1
InChI Key: InChIKey=NKONTEUZTOHVNH-OFSOJUDTSA-N
Data: 2 IC50
Activity Spreadsheet -- Enzyme Inhibition Constant Data from BindingDB
Found 2 hits for monomerid = 50146743
Trg + Lig
Ki
nM
ΔG°
kcal/mole
IC50
nM
Kd
nM
EC50/IC50
nM
koff
s-1
kon
M-1s-1
pHTemp
°C
Endothelin-1 receptor
(Homo sapiens (Human))
BDBM50146743
((S)-(4,6-Dimethyl-pyrimidin-2-yloxy)-[(S)-2-oxo-5-...)
Show SMILES Cc1cc(C)nc(O[C@H](C(O)=O)[C@]2(NCC(=O)N(Cc3c(F)ccc(F)c3F)c3ccccc23)c2ccccc2)n1
Show InChI InChI=1S/C30H25F3N4O4/c1-17-14-18(2)36-29(35-17)41-27(28(39)40)30(19-8-4-3-5-9-19)21-10-6-7-11-24(21)37(25(38)15-34-30)16-20-22(31)12-13-23(32)26(20)33/h3-14,27,34H,15-16H2,1-2H3,(H,39,40)/t27-,30+/m1/s1
n/an/a 2.40n/an/an/an/an/an/a
Actelion Pharmaceuticals Ltd.
Curated by ChEMBL
Assay Description
Antagonist activity towards human recombinant Endothelin A receptor expressed in chinese hamster ovary (CHO) cells determined using [125I]-ET-1 as ra...
J Med Chem 47: 2776-95 (2004)
Article DOI: 10.1021/jm031115r
BindingDB Entry DOI: 10.7270/Q2Z89BVT
EDNRB
(Homo sapiens (Human))
BDBM50146743
((S)-(4,6-Dimethyl-pyrimidin-2-yloxy)-[(S)-2-oxo-5-...)
Show SMILES Cc1cc(C)nc(O[C@H](C(O)=O)[C@]2(NCC(=O)N(Cc3c(F)ccc(F)c3F)c3ccccc23)c2ccccc2)n1
Show InChI InChI=1S/C30H25F3N4O4/c1-17-14-18(2)36-29(35-17)41-27(28(39)40)30(19-8-4-3-5-9-19)21-10-6-7-11-24(21)37(25(38)15-34-30)16-20-22(31)12-13-23(32)26(20)33/h3-14,27,34H,15-16H2,1-2H3,(H,39,40)/t27-,30+/m1/s1
n/an/a 13.2n/an/an/an/an/an/a
Actelion Pharmaceuticals Ltd.
Curated by ChEMBL
Assay Description
Antagonist activity towards human recombinant Endothelin B receptor expressed in chinese hamster ovary (CHO) cells determined using [125I]-ET-1 as ra...
J Med Chem 47: 2776-95 (2004)
Article DOI: 10.1021/jm031115r
BindingDB Entry DOI: 10.7270/Q2Z89BVT