BDBM50146975 2-(S)-Amino-4-benzylamino-1-piperidin-1-yl-butan-1-one::CHEMBL99263
SMILES: N[C@@H](CCNCc1ccccc1)C(=O)N1CCCCC1
InChI Key: InChIKey=IYWREIXDOWSXJB-HNNXBMFYSA-N
Data: 2 IC50
Activity Spreadsheet -- Enzyme Inhibition Constant Data from BindingDB
Found 2 hits for monomerid = 50146975
Trg + Lig
Ki
nM
ΔG°
kcal/mole
IC50
nM
Kd
nM
EC50/IC50
nM
koff
s-1
kon
M-1s-1
pHTemp
°C
Dipeptidyl peptidase 4
(Homo sapiens (Human))
BDBM50146975
(2-(S)-Amino-4-benzylamino-1-piperidin-1-yl-butan-1...)
Show SMILES N[C@@H](CCNCc1ccccc1)C(=O)N1CCCCC1
Show InChI InChI=1S/C16H25N3O/c17-15(16(20)19-11-5-2-6-12-19)9-10-18-13-14-7-3-1-4-8-14/h1,3-4,7-8,15,18H,2,5-6,9-13,17H2/t15-/m0/s1
Reactome pathway
n/an/a 2.47E+5n/an/an/an/an/an/a
University of Antwerp
Curated by ChEMBL
Assay Description
Inhibition of human Dipeptidyl-peptidase IV (DPP IV)
J Med Chem 47: 2906-16 (2004)
Article DOI: 10.1021/jm031122f
BindingDB Entry DOI: 10.7270/Q2TH8M4H
Dipeptidyl peptidase 2 (DPP II)
(Homo sapiens (Human))
BDBM50146975
(2-(S)-Amino-4-benzylamino-1-piperidin-1-yl-butan-1...)
Show SMILES N[C@@H](CCNCc1ccccc1)C(=O)N1CCCCC1
Show InChI InChI=1S/C16H25N3O/c17-15(16(20)19-11-5-2-6-12-19)9-10-18-13-14-7-3-1-4-8-14/h1,3-4,7-8,15,18H,2,5-6,9-13,17H2/t15-/m0/s1
n/an/a 2.03n/an/an/an/an/an/a
University of Antwerp
Curated by ChEMBL
Assay Description
Inhibition of human Dipeptidyl-peptidase II (DPP II)
J Med Chem 47: 2906-16 (2004)
Article DOI: 10.1021/jm031122f
BindingDB Entry DOI: 10.7270/Q2TH8M4H