BDBM50146987 (S)-2-Amino-4-[(4-chloro-benzyl)-methyl-amino]-1-piperidin-1-yl-butan-1-one::CHEMBL98801
SMILES: CN(CC[C@H](N)C(=O)N1CCCCC1)Cc1ccc(Cl)cc1
InChI Key: InChIKey=URTZVTGXBHKFLU-INIZCTEOSA-N
Data: 2 IC50
Activity Spreadsheet -- Enzyme Inhibition Constant Data from BindingDB
Found 2 hits for monomerid = 50146987
Trg + Lig
Ki
nM
ΔG°
kcal/mole
IC50
nM
Kd
nM
EC50/IC50
nM
koff
s-1
kon
M-1s-1
pHTemp
°C
Dipeptidyl peptidase 4
(Homo sapiens (Human))
BDBM50146987
((S)-2-Amino-4-[(4-chloro-benzyl)-methyl-amino]-1-p...)
Show SMILES CN(CC[C@H](N)C(=O)N1CCCCC1)Cc1ccc(Cl)cc1
Show InChI InChI=1S/C17H26ClN3O/c1-20(13-14-5-7-15(18)8-6-14)12-9-16(19)17(22)21-10-3-2-4-11-21/h5-8,16H,2-4,9-13,19H2,1H3/t16-/m0/s1
Reactome pathway
n/an/a 1.96E+5n/an/an/an/an/an/a
University of Antwerp
Curated by ChEMBL
Assay Description
Inhibition of human Dipeptidyl-peptidase IV (DPP IV)
J Med Chem 47: 2906-16 (2004)
Article DOI: 10.1021/jm031122f
BindingDB Entry DOI: 10.7270/Q2TH8M4H
Dipeptidyl peptidase 2 (DPP II)
(Homo sapiens (Human))
BDBM50146987
((S)-2-Amino-4-[(4-chloro-benzyl)-methyl-amino]-1-p...)
Show SMILES CN(CC[C@H](N)C(=O)N1CCCCC1)Cc1ccc(Cl)cc1
Show InChI InChI=1S/C17H26ClN3O/c1-20(13-14-5-7-15(18)8-6-14)12-9-16(19)17(22)21-10-3-2-4-11-21/h5-8,16H,2-4,9-13,19H2,1H3/t16-/m0/s1
n/an/a 0.220n/an/an/an/an/an/a
University of Antwerp
Curated by ChEMBL
Assay Description
Inhibition of human Dipeptidyl-peptidase II (DPP II)
J Med Chem 47: 2906-16 (2004)
Article DOI: 10.1021/jm031122f
BindingDB Entry DOI: 10.7270/Q2TH8M4H