BDBM50147245 4-Isobutyl-3-methyl-2-(4-phenyl-piperidine-1-carbonyl)-2H-isoxazol-5-one::4-isobutyl-3-methyl-2-(4-phenylpiperidine-1-carbonyl)isoxazol-5(2H)-one::CHEMBL106784
SMILES: CC(C)Cc1c(C)n(oc1=O)C(=O)N1CCC(CC1)c1ccccc1
InChI Key: InChIKey=RXLKHXHQPCQNHH-UHFFFAOYSA-N
Data: 3 IC50
Activity Spreadsheet -- Enzyme Inhibition Constant Data from BindingDB
Found 3 hits for monomerid = 50147245
Trg + Lig
Ki
nM
ΔG°
kcal/mole
IC50
nM
Kd
nM
EC50/IC50
nM
koff
s-1
kon
M-1s-1
pHTemp
°C
Hormone-sensitive lipase (HSL)
(Homo sapiens (Human))
BDBM50147245
(4-Isobutyl-3-methyl-2-(4-phenyl-piperidine-1-carbo...)
Show SMILES CC(C)Cc1c(C)n(oc1=O)C(=O)N1CCC(CC1)c1ccccc1
Show InChI InChI=1S/C20H26N2O3/c1-14(2)13-18-15(3)22(25-19(18)23)20(24)21-11-9-17(10-12-21)16-7-5-4-6-8-16/h4-8,14,17H,9-13H2,1-3H3
Reactome pathway
n/an/a 4n/an/an/an/an/an/a
Bayer Research Center
Curated by ChEMBL
Assay Description
Inhibition of forskolin-stimulated lipolysis in differentiated 3T3-L1 cells
Bioorg Med Chem Lett 14: 3155-9 (2004)
Article DOI: 10.1016/j.bmcl.2004.04.015
BindingDB Entry DOI: 10.7270/Q2NV9HQ5
Hormone sensitive lipase
(Homo sapiens (Human))
BDBM50147245
(4-Isobutyl-3-methyl-2-(4-phenyl-piperidine-1-carbo...)
Show SMILES CC(C)Cc1c(C)n(oc1=O)C(=O)N1CCC(CC1)c1ccccc1
Show InChI InChI=1S/C20H26N2O3/c1-14(2)13-18-15(3)22(25-19(18)23)20(24)21-11-9-17(10-12-21)16-7-5-4-6-8-16/h4-8,14,17H,9-13H2,1-3H3
Reactome pathway
n/an/a 10n/an/an/an/an/an/a
Bayer Research Center
Curated by ChEMBL
Assay Description
Inhibition of human recombinant hormone sensitive lipase (HSL)
Bioorg Med Chem Lett 14: 3155-9 (2004)
Article DOI: 10.1016/j.bmcl.2004.04.015
BindingDB Entry DOI: 10.7270/Q2NV9HQ5
Hormone-sensitive lipase (HSL)
(Rattus norvegicus (Rat))
BDBM50147245
(4-Isobutyl-3-methyl-2-(4-phenyl-piperidine-1-carbo...)
Show SMILES CC(C)Cc1c(C)n(oc1=O)C(=O)N1CCC(CC1)c1ccccc1
Show InChI InChI=1S/C20H26N2O3/c1-14(2)13-18-15(3)22(25-19(18)23)20(24)21-11-9-17(10-12-21)16-7-5-4-6-8-16/h4-8,14,17H,9-13H2,1-3H3
n/an/a 10n/an/an/an/an/an/a
University of Jordan
Curated by ChEMBL
Assay Description
Inhibition of HSL in Wistar rat isolated fat cells by spectrophotometric assay
J Med Chem 51: 6478-94 (2008)
Article DOI: 10.1021/jm800718k
BindingDB Entry DOI: 10.7270/Q23778KJ