BDBM50147271 4-Isopropyl-3-methyl-5-oxo-5H-isoxazole-2-carboxylic acid methyl-phenyl-amide::4-isopropyl-N,3-dimethyl-5-oxo-N-phenylisoxazole-2(5H)-carboxamide::CHEMBL110597
SMILES: CC(C)c1c(C)n(oc1=O)C(=O)N(C)c1ccccc1
InChI Key: InChIKey=TVBKICBPMURFCU-UHFFFAOYSA-N
Data: 3 IC50
Activity Spreadsheet -- Enzyme Inhibition Constant Data from BindingDB
Found 3 hits for monomerid = 50147271
Trg + Lig
Ki
nM
ΔG°
kcal/mole
IC50
nM
Kd
nM
EC50/IC50
nM
koff
s-1
kon
M-1s-1
pHTemp
°C
Hormone-sensitive lipase (HSL)
(Homo sapiens (Human))
BDBM50147271
(4-Isopropyl-3-methyl-5-oxo-5H-isoxazole-2-carboxyl...)
Show SMILES CC(C)c1c(C)n(oc1=O)C(=O)N(C)c1ccccc1
Show InChI InChI=1S/C15H18N2O3/c1-10(2)13-11(3)17(20-14(13)18)15(19)16(4)12-8-6-5-7-9-12/h5-10H,1-4H3
Reactome pathway
n/an/a 190n/an/an/an/an/an/a
Bayer Research Center
Curated by ChEMBL
Assay Description
Inhibition of forskolin-stimulated lipolysis in differentiated 3T3-L1 cells
Bioorg Med Chem Lett 14: 3155-9 (2004)
Article DOI: 10.1016/j.bmcl.2004.04.015
BindingDB Entry DOI: 10.7270/Q2NV9HQ5
Hormone sensitive lipase
(Homo sapiens (Human))
BDBM50147271
(4-Isopropyl-3-methyl-5-oxo-5H-isoxazole-2-carboxyl...)
Show SMILES CC(C)c1c(C)n(oc1=O)C(=O)N(C)c1ccccc1
Show InChI InChI=1S/C15H18N2O3/c1-10(2)13-11(3)17(20-14(13)18)15(19)16(4)12-8-6-5-7-9-12/h5-10H,1-4H3
Reactome pathway
n/an/a 7n/an/an/an/an/an/a
Bayer Research Center
Curated by ChEMBL
Assay Description
Inhibition of human recombinant hormone sensitive lipase (HSL)
Bioorg Med Chem Lett 14: 3155-9 (2004)
Article DOI: 10.1016/j.bmcl.2004.04.015
BindingDB Entry DOI: 10.7270/Q2NV9HQ5
Hormone-sensitive lipase (HSL)
(Rattus norvegicus (Rat))
BDBM50147271
(4-Isopropyl-3-methyl-5-oxo-5H-isoxazole-2-carboxyl...)
Show SMILES CC(C)c1c(C)n(oc1=O)C(=O)N(C)c1ccccc1
Show InChI InChI=1S/C15H18N2O3/c1-10(2)13-11(3)17(20-14(13)18)15(19)16(4)12-8-6-5-7-9-12/h5-10H,1-4H3
n/an/a 7n/an/an/an/an/an/a
University of Jordan
Curated by ChEMBL
Assay Description
Inhibition of HSL in Wistar rat isolated fat cells by spectrophotometric assay
J Med Chem 51: 6478-94 (2008)
Article DOI: 10.1021/jm800718k
BindingDB Entry DOI: 10.7270/Q23778KJ