BDBM50147276 4-Cyclopentyl-3-methyl-2-(piperidine-1-carbonyl)-2H-isoxazol-5-one::4-cyclopentyl-3-methyl-2-(piperidine-1-carbonyl)isoxazol-5(2H)-one::CHEMBL321903
SMILES: Cc1c(C2CCCC2)c(=O)on1C(=O)N1CCCCC1
InChI Key: InChIKey=VKRWBZVDKHZBNR-UHFFFAOYSA-N
Data: 3 IC50
Activity Spreadsheet -- Enzyme Inhibition Constant Data from BindingDB
Found 3 hits for monomerid = 50147276
Trg + Lig
Ki
nM
ΔG°
kcal/mole
IC50
nM
Kd
nM
EC50/IC50
nM
koff
s-1
kon
M-1s-1
pHTemp
°C
Hormone-sensitive lipase (HSL)
(Homo sapiens (Human))
BDBM50147276
(4-Cyclopentyl-3-methyl-2-(piperidine-1-carbonyl)-2...)
Show SMILES Cc1c(C2CCCC2)c(=O)on1C(=O)N1CCCCC1
Show InChI InChI=1S/C15H22N2O3/c1-11-13(12-7-3-4-8-12)14(18)20-17(11)15(19)16-9-5-2-6-10-16/h12H,2-10H2,1H3
Reactome pathway
n/an/a 6n/an/an/an/an/an/a
Bayer Research Center
Curated by ChEMBL
Assay Description
Inhibition of human recombinant hormone sensitive lipase (HSL)
Bioorg Med Chem Lett 14: 3155-9 (2004)
Article DOI: 10.1016/j.bmcl.2004.04.015
BindingDB Entry DOI: 10.7270/Q2NV9HQ5
Hormone sensitive lipase
(Homo sapiens (Human))
BDBM50147276
(4-Cyclopentyl-3-methyl-2-(piperidine-1-carbonyl)-2...)
Show SMILES Cc1c(C2CCCC2)c(=O)on1C(=O)N1CCCCC1
Show InChI InChI=1S/C15H22N2O3/c1-11-13(12-7-3-4-8-12)14(18)20-17(11)15(19)16-9-5-2-6-10-16/h12H,2-10H2,1H3
Reactome pathway
n/an/a 22n/an/an/an/an/an/a
Bayer Research Center
Curated by ChEMBL
Assay Description
Inhibition of forskolin-stimulated lipolysis in differentiated 3T3-L1 cells
Bioorg Med Chem Lett 14: 3155-9 (2004)
Article DOI: 10.1016/j.bmcl.2004.04.015
BindingDB Entry DOI: 10.7270/Q2NV9HQ5
Hormone-sensitive lipase (HSL)
(Rattus norvegicus (Rat))
BDBM50147276
(4-Cyclopentyl-3-methyl-2-(piperidine-1-carbonyl)-2...)
Show SMILES Cc1c(C2CCCC2)c(=O)on1C(=O)N1CCCCC1
Show InChI InChI=1S/C15H22N2O3/c1-11-13(12-7-3-4-8-12)14(18)20-17(11)15(19)16-9-5-2-6-10-16/h12H,2-10H2,1H3
n/an/a 6n/an/an/an/an/an/a
University of Jordan
Curated by ChEMBL
Assay Description
Inhibition of HSL in Wistar rat isolated fat cells by spectrophotometric assay
J Med Chem 51: 6478-94 (2008)
Article DOI: 10.1021/jm800718k
BindingDB Entry DOI: 10.7270/Q23778KJ