BDBM50147289 4-Isobutyl-3-methyl-2-(piperidine-1-carbonyl)-2H-isoxazol-5-one::4-isobutyl-3-methyl-2-(piperidine-1-carbonyl)isoxazol-5(2H)-one::CHEMBL110653
SMILES: CC(C)Cc1c(C)n(oc1=O)C(=O)N1CCCCC1
InChI Key: InChIKey=OXHMVTWDDXGXBM-UHFFFAOYSA-N
Data: 3 IC50
Activity Spreadsheet -- Enzyme Inhibition Constant Data from BindingDB
Found 3 hits for monomerid = 50147289
Trg + Lig
Ki
nM
ΔG°
kcal/mole
IC50
nM
Kd
nM
EC50/IC50
nM
koff
s-1
kon
M-1s-1
pHTemp
°C
Hormone-sensitive lipase (HSL)
(Homo sapiens (Human))
BDBM50147289
(4-Isobutyl-3-methyl-2-(piperidine-1-carbonyl)-2H-i...)
Show SMILES CC(C)Cc1c(C)n(oc1=O)C(=O)N1CCCCC1
Show InChI InChI=1S/C14H22N2O3/c1-10(2)9-12-11(3)16(19-13(12)17)14(18)15-7-5-4-6-8-15/h10H,4-9H2,1-3H3
Reactome pathway
n/an/a 32n/an/an/an/an/an/a
Bayer Research Center
Curated by ChEMBL
Assay Description
Inhibition of forskolin-stimulated lipolysis in differentiated 3T3-L1 cells
Bioorg Med Chem Lett 14: 3155-9 (2004)
Article DOI: 10.1016/j.bmcl.2004.04.015
BindingDB Entry DOI: 10.7270/Q2NV9HQ5
Hormone sensitive lipase
(Homo sapiens (Human))
BDBM50147289
(4-Isobutyl-3-methyl-2-(piperidine-1-carbonyl)-2H-i...)
Show SMILES CC(C)Cc1c(C)n(oc1=O)C(=O)N1CCCCC1
Show InChI InChI=1S/C14H22N2O3/c1-10(2)9-12-11(3)16(19-13(12)17)14(18)15-7-5-4-6-8-15/h10H,4-9H2,1-3H3
Reactome pathway
n/an/a 5n/an/an/an/an/an/a
Bayer Research Center
Curated by ChEMBL
Assay Description
Inhibition of forskolin-stimulated lipolysis in differentiated 3T3-L1 cells
Bioorg Med Chem Lett 14: 3155-9 (2004)
Article DOI: 10.1016/j.bmcl.2004.04.015
BindingDB Entry DOI: 10.7270/Q2NV9HQ5
Hormone-sensitive lipase (HSL)
(Rattus norvegicus (Rat))
BDBM50147289
(4-Isobutyl-3-methyl-2-(piperidine-1-carbonyl)-2H-i...)
Show SMILES CC(C)Cc1c(C)n(oc1=O)C(=O)N1CCCCC1
Show InChI InChI=1S/C14H22N2O3/c1-10(2)9-12-11(3)16(19-13(12)17)14(18)15-7-5-4-6-8-15/h10H,4-9H2,1-3H3
n/an/a 5n/an/an/an/an/an/a
University of Jordan
Curated by ChEMBL
Assay Description
Inhibition of HSL in Wistar rat isolated fat cells by spectrophotometric assay
J Med Chem 51: 6478-94 (2008)
Article DOI: 10.1021/jm800718k
BindingDB Entry DOI: 10.7270/Q23778KJ