BDBM50147505 (2S,4aS,6aS,6bR,10S,12aS,14bR)-10-Hydroxy-2,4a,6a,6b,9,9,12a-heptamethyl-13-oxo-1,2,3,4,4a,5,6,6a,6b,7,8,8a,9,10,11,12,12a,12b,13,14b-icosahydro-picene-2-carboxylic acid (2-hydroxy-ethyl)-amide::CHEMBL113962
SMILES: CC1(C)[C@@H](O)CC[C@@]2(C)C1CC[C@]1(C)C2C(=O)C=C2[C@@H]3C[C@](C)(CC[C@]3(C)CC[C@@]12C)C(=O)NCCO
InChI Key: InChIKey=CUHQXRIETJJGQE-DGWUYHICSA-N
Data: 1 IC50
Activity Spreadsheet -- Enzyme Inhibition Constant Data from BindingDB
Found 1 hit for monomerid = 50147505
Trg + Lig
Ki
nM
ΔG°
kcal/mole
IC50
nM
Kd
nM
EC50/IC50
nM
koff
s-1
kon
M-1s-1
pHTemp
°C
11-beta-hydroxysteroid dehydrogenase 2
(Rattus norvegicus)
BDBM50147505
((2S,4aS,6aS,6bR,10S,12aS,14bR)-10-Hydroxy-2,4a,6a,...)
Show SMILES CC1(C)[C@@H](O)CC[C@@]2(C)C1CC[C@]1(C)C2C(=O)C=C2[C@@H]3C[C@](C)(CC[C@]3(C)CC[C@@]12C)C(=O)NCCO |t:19|
Show InChI InChI=1S/C32H51NO4/c1-27(2)23-8-11-32(7)25(30(23,5)10-9-24(27)36)22(35)18-20-21-19-29(4,26(37)33-16-17-34)13-12-28(21,3)14-15-31(20,32)6/h18,21,23-25,34,36H,8-17,19H2,1-7H3,(H,33,37)/t21-,23?,24-,25?,28+,29-,30-,31+,32+/m0/s1
n/an/a 0.00400n/an/an/an/an/an/a
University of Bath
Curated by ChEMBL
Assay Description
Percent inhibition against 11-beta-hydroxysteroid dehydrogenase 2 of wistar rat kidney at 10 microM was determined using [3H]-cortisol
Bioorg Med Chem Lett 14: 3263-7 (2004)
Article DOI: 10.1016/j.bmcl.2004.03.107
BindingDB Entry DOI: 10.7270/Q2H41QWC