BDBM50147533 2-(5-(5-(3,5-difluorophenyl)benzo[d]oxazol-2-yl)-2-methoxyphenyl)-1,3-dioxoisoindoline-5-carboxylic acid::2-{5-[5-(3,5-Difluoro-phenyl)-benzooxazol-2-yl]-2-methoxy-phenyl}-1,3-dioxo-indan-5-carboxylic acid::CHEMBL109419
SMILES: COc1ccc(cc1N1C(=O)c2ccc(cc2C1=O)C(O)=O)-c1nc2cc(ccc2o1)-c1cc(F)cc(F)c1
InChI Key: InChIKey=RITWDJLFSHWLCS-UHFFFAOYSA-N
Data: 2 IC50
Activity Spreadsheet -- Enzyme Inhibition Constant Data from BindingDB
Found 2 hits for monomerid = 50147533
Trg + Lig
Ki
nM
ΔG°
kcal/mole
IC50
nM
Kd
nM
EC50/IC50
nM
koff
s-1
kon
M-1s-1
pHTemp
°C
Heparanase
(Homo sapiens (Human))
BDBM50147533
(2-(5-(5-(3,5-difluorophenyl)benzo[d]oxazol-2-yl)-2...)
Show SMILES COc1ccc(cc1N1C(=O)c2ccc(cc2C1=O)C(O)=O)-c1nc2cc(ccc2o1)-c1cc(F)cc(F)c1
Show InChI InChI=1S/C29H16F2N2O6/c1-38-25-7-4-15(12-23(25)33-27(34)20-5-2-16(29(36)37)10-21(20)28(33)35)26-32-22-11-14(3-6-24(22)39-26)17-8-18(30)13-19(31)9-17/h2-13H,1H3,(H,36,37)
n/an/a 398n/an/an/an/an/an/a
Sharif University of Technology
Curated by ChEMBL
Assay Description
Inhibition of heparanase
Eur J Med Chem 43: 548-56 (2008)
Article DOI: 10.1016/j.ejmech.2007.04.014
BindingDB Entry DOI: 10.7270/Q2PC33KM
Heparanase
(Homo sapiens (Human))
BDBM50147533
(2-(5-(5-(3,5-difluorophenyl)benzo[d]oxazol-2-yl)-2...)
Show SMILES COc1ccc(cc1N1C(=O)c2ccc(cc2C1=O)C(O)=O)-c1nc2cc(ccc2o1)-c1cc(F)cc(F)c1
Show InChI InChI=1S/C29H16F2N2O6/c1-38-25-7-4-15(12-23(25)33-27(34)20-5-2-16(29(36)37)10-21(20)28(33)35)26-32-22-11-14(3-6-24(22)39-26)17-8-18(30)13-19(31)9-17/h2-13H,1H3,(H,36,37)
n/an/a 400n/an/an/an/an/an/a
Celltech R&D Ltd
Curated by ChEMBL
Assay Description
In vivo inhibitory activity against human Heparanase
Bioorg Med Chem Lett 14: 3269-73 (2004)
Article DOI: 10.1016/j.bmcl.2004.03.086
BindingDB Entry DOI: 10.7270/Q2CC1040