BDBM50147534 1,3-Dioxo-2-[3-(5-phenyl-benzooxazol-2-yl)-4-propylamino-phenyl]-indan-5-carboxylic acid::1,3-dioxo-2-(3-(5-phenylbenzo[d]oxazol-2-yl)-4-(propylamino)phenyl)isoindoline-5-carboxylic acid::CHEMBL109657
SMILES: CCCNc1ccc(cc1-c1nc2cc(ccc2o1)-c1ccccc1)N1C(=O)c2ccc(cc2C1=O)C(O)=O
InChI Key: InChIKey=PURUNRMSWAQLDE-UHFFFAOYSA-N
Data: 2 IC50
Activity Spreadsheet -- Enzyme Inhibition Constant Data from BindingDB
Found 2 hits for monomerid = 50147534
Trg + Lig
Ki
nM
ΔG°
kcal/mole
IC50
nM
Kd
nM
EC50/IC50
nM
koff
s-1
kon
M-1s-1
pHTemp
°C
Heparanase
(Homo sapiens (Human))
BDBM50147534
(1,3-Dioxo-2-[3-(5-phenyl-benzooxazol-2-yl)-4-propy...)
Show SMILES CCCNc1ccc(cc1-c1nc2cc(ccc2o1)-c1ccccc1)N1C(=O)c2ccc(cc2C1=O)C(O)=O
Show InChI InChI=1S/C31H23N3O5/c1-2-14-32-25-12-10-21(34-29(35)22-11-8-20(31(37)38)15-23(22)30(34)36)17-24(25)28-33-26-16-19(9-13-27(26)39-28)18-6-4-3-5-7-18/h3-13,15-17,32H,2,14H2,1H3,(H,37,38)
n/an/a 251n/an/an/an/an/an/a
Sharif University of Technology
Curated by ChEMBL
Assay Description
Inhibition of heparanase
Eur J Med Chem 43: 548-56 (2008)
Article DOI: 10.1016/j.ejmech.2007.04.014
BindingDB Entry DOI: 10.7270/Q2PC33KM
Heparanase
(Homo sapiens (Human))
BDBM50147534
(1,3-Dioxo-2-[3-(5-phenyl-benzooxazol-2-yl)-4-propy...)
Show SMILES CCCNc1ccc(cc1-c1nc2cc(ccc2o1)-c1ccccc1)N1C(=O)c2ccc(cc2C1=O)C(O)=O
Show InChI InChI=1S/C31H23N3O5/c1-2-14-32-25-12-10-21(34-29(35)22-11-8-20(31(37)38)15-23(22)30(34)36)17-24(25)28-33-26-16-19(9-13-27(26)39-28)18-6-4-3-5-7-18/h3-13,15-17,32H,2,14H2,1H3,(H,37,38)
n/an/a 250n/an/an/an/an/an/a
Celltech R&D Ltd
Curated by ChEMBL
Assay Description
In vivo inhibitory activity against human Heparanase
Bioorg Med Chem Lett 14: 3269-73 (2004)
Article DOI: 10.1016/j.bmcl.2004.03.086
BindingDB Entry DOI: 10.7270/Q2CC1040