BDBM50147575 Benzyl-dimethyl-tetradecyl-ammonium; bromide::CHEMBL112719
SMILES: CCCCCCCCCCCCCC[N+](C)(C)Cc1ccccc1
InChI Key: InChIKey=WNBGYVXHFTYOBY-UHFFFAOYSA-N
Data: 1 IC50
Activity Spreadsheet -- Enzyme Inhibition Constant Data from BindingDB
Found 1 hit for monomerid = 50147575
Trg + Lig
Ki
nM
ΔG°
kcal/mole
IC50
nM
Kd
nM
EC50/IC50
nM
koff
s-1
kon
M-1s-1
pHTemp
°C
Dynamin-1
(Homo sapiens (Human))
BDBM50147575
(Benzyl-dimethyl-tetradecyl-ammonium; bromide | CHE...)
Show SMILES CCCCCCCCCCCCCC[N+](C)(C)Cc1ccccc1
Show InChI InChI=1S/C23H42N/c1-4-5-6-7-8-9-10-11-12-13-14-18-21-24(2,3)22-23-19-16-15-17-20-23/h15-17,19-20H,4-14,18,21-22H2,1-3H3/q+1
NCI pathway
Reactome pathway
n/an/a 1.96E+4n/an/an/an/an/an/a
The University of Newcastle
Curated by ChEMBL
Assay Description
Concentration required against dynamin-1 GTPase activity of sheep brain.
Bioorg Med Chem Lett 14: 3275-8 (2004)
Article DOI: 10.1016/j.bmcl.2004.03.096
BindingDB Entry DOI: 10.7270/Q27M07CT