null
SMILES: C[C@@H](N(CC(O)=O)S(=O)(=O)c1ccc(OC(F)F)cc1)c1ccc(cc1)-c1ccc(Cl)cc1Cl
InChI Key: InChIKey=QJWNOQBDIXMTTK-CQSZACIVSA-N
Activity Spreadsheet -- Enzyme Inhibition Constant Data from BindingDB
Found 2 hits for monomerid = 50147616
Trg + Lig
Ki
nM
ΔG°
kcal/mole
IC50
nM
Kd
nM
EC50/IC50
nM
koff
s-1
kon
M-1s-1
pHTemp
°C
Diacylglycerol lipase-alpha
(Homo sapiens (Human))
BDBM50147616
(CHEMBL3765497)
Show SMILES C[C@@H](N(CC(O)=O)S(=O)(=O)c1ccc(OC(F)F)cc1)c1ccc(cc1)-c1ccc(Cl)cc1Cl |r|
Show InChI InChI=1S/C23H19Cl2F2NO5S/c1-14(15-2-4-16(5-3-15)20-11-6-17(24)12-21(20)25)28(13-22(29)30)34(31,32)19-9-7-18(8-10-19)33-23(26)27/h2-12,14,23H,13H2,1H3,(H,29,30)/t14-/m1/s1
NCI pathway
Reactome pathway
n/an/a 19n/an/an/an/an/an/a
Bristol-Myers Squibb Co.
Curated by ChEMBL
Assay Description
Inhibition of full length human C-terminal HA-tagged DAGLalpha expressed in HEK293 cells using DAG as substrate assessed as reduction in intracellula...
Bioorg Med Chem 24: 1455-68 (2016)
BindingDB Entry DOI: 10.7270/Q2RJ4MBD
Diacylglycerol lipase-alpha
(Homo sapiens (Human))
BDBM50147616
(CHEMBL3765497)
Show SMILES C[C@@H](N(CC(O)=O)S(=O)(=O)c1ccc(OC(F)F)cc1)c1ccc(cc1)-c1ccc(Cl)cc1Cl |r|
Show InChI InChI=1S/C23H19Cl2F2NO5S/c1-14(15-2-4-16(5-3-15)20-11-6-17(24)12-21(20)25)28(13-22(29)30)34(31,32)19-9-7-18(8-10-19)33-23(26)27/h2-12,14,23H,13H2,1H3,(H,29,30)/t14-/m1/s1
NCI pathway
Reactome pathway
n/an/a 100n/an/an/an/an/an/a
Bristol-Myers Squibb Co.
Curated by ChEMBL
Assay Description
Inhibition of full length human C-terminal HA-tagged DAGLalpha expressed in HEK293 cells using DAG as substrate assessed as reduction in intracellula...
Bioorg Med Chem 24: 1455-68 (2016)
BindingDB Entry DOI: 10.7270/Q2RJ4MBD