BDBM50147683 CHEMBL3765457
SMILES: O=c1nc(oc2c(cccc12)-c1cccc2ccccc12)N1CCOCC1
InChI Key: InChIKey=HSONTPGVHUWDEY-UHFFFAOYSA-N
Data: 3 IC50
Activity Spreadsheet -- Enzyme Inhibition Constant Data from BindingDB
Found 3 hits for monomerid = 50147683
Trg + Lig
Ki
nM
ΔG°
kcal/mole
IC50
nM
Kd
nM
EC50/IC50
nM
koff
s-1
kon
M-1s-1
pHTemp
°C
Phosphatidylinositol 4,5-bisphosphate 3-kinase catalytic subunit beta isoform
(Homo sapiens (Human))
BDBM50147683
(CHEMBL3765457)
Show SMILES O=c1nc(oc2c(cccc12)-c1cccc2ccccc12)N1CCOCC1
Show InChI InChI=1S/C22H18N2O3/c25-21-19-10-4-9-18(17-8-3-6-15-5-1-2-7-16(15)17)20(19)27-22(23-21)24-11-13-26-14-12-24/h1-10H,11-14H2
NCI pathway
Reactome pathway
n/an/a 5.00E+3n/an/an/an/an/an/a
La Trobe University
Curated by ChEMBL
Assay Description
Inhibition of PI3Kbeta (unknown origin) incubated for 60 mins by kinase-glo luminescence assay
Eur J Med Chem 110: 326-39 (2016)
BindingDB Entry DOI: 10.7270/Q2H133V6
DNA-dependent protein kinase catalytic subunit
(Homo sapiens (Human))
BDBM50147683
(CHEMBL3765457)
Show SMILES O=c1nc(oc2c(cccc12)-c1cccc2ccccc12)N1CCOCC1
Show InChI InChI=1S/C22H18N2O3/c25-21-19-10-4-9-18(17-8-3-6-15-5-1-2-7-16(15)17)20(19)27-22(23-21)24-11-13-26-14-12-24/h1-10H,11-14H2
n/an/a 2.03E+4n/an/an/an/an/an/a
La Trobe University
Curated by ChEMBL
Assay Description
Inhibition of human DNA-PK using EPPLSQEAFADLWKK as substrate by HTRF assay
Eur J Med Chem 110: 326-39 (2016)
BindingDB Entry DOI: 10.7270/Q2H133V6
Phosphatidylinositol 4,5-bisphosphate 3-kinase catalytic subunit delta isoform
(Homo sapiens (Human))
BDBM50147683
(CHEMBL3765457)
Show SMILES O=c1nc(oc2c(cccc12)-c1cccc2ccccc12)N1CCOCC1
Show InChI InChI=1S/C22H18N2O3/c25-21-19-10-4-9-18(17-8-3-6-15-5-1-2-7-16(15)17)20(19)27-22(23-21)24-11-13-26-14-12-24/h1-10H,11-14H2
NCI pathway
Reactome pathway
n/an/a 640n/an/an/an/an/an/a
La Trobe University
Curated by ChEMBL
Assay Description
Inhibition of PI3Kdelta (unknown origin) incubated for 60 mins by kinase-glo luminescence assay
Eur J Med Chem 110: 326-39 (2016)
BindingDB Entry DOI: 10.7270/Q2H133V6