BDBM50147733 CHEMBL3763165
SMILES: Cc1nc2sc3ccccc3n2c1C(=O)NC1CCCCC1
InChI Key: InChIKey=VDEJMICBEMJDSA-UHFFFAOYSA-N
Data: 1 IC50
Activity Spreadsheet -- Enzyme Inhibition Constant Data from BindingDB
Found 1 hit for monomerid = 50147733
Trg + Lig
Ki
nM
ΔG°
kcal/mole
IC50
nM
Kd
nM
EC50/IC50
nM
koff
s-1
kon
M-1s-1
pHTemp
°C
Pantothenate synthetase
(Mycobacterium tuberculosis (strain ATCC 25618 / H3...)
BDBM50147733
(CHEMBL3763165)
Show SMILES Cc1nc2sc3ccccc3n2c1C(=O)NC1CCCCC1
Show InChI InChI=1S/C17H19N3OS/c1-11-15(16(21)19-12-7-3-2-4-8-12)20-13-9-5-6-10-14(13)22-17(20)18-11/h5-6,9-10,12H,2-4,7-8H2,1H3,(H,19,21)
n/an/a 1.02E+3n/an/an/an/an/an/a
Birla Institute of Technology& Science-Pilani
Curated by ChEMBL
Assay Description
Inhibition of Mycobacterium tuberculosis pantothenate synthetase using pantoic acid as substrate and beta-alanine as reactant assessed as NAD+ format...
Bioorg Med Chem 24: 1298-307 (2016)
BindingDB Entry DOI: 10.7270/Q2C82C5B