BDBM50148192 CHEMBL3765578
SMILES: CC1(C)CCc2cc(ccc2O1)S(=O)(=O)N(CC(O)=O)C1(CCCC1)c1cccc(c1)-c1cc(Cl)cc(Cl)c1
InChI Key: InChIKey=GHRCDTBILOTJST-UHFFFAOYSA-N
Data: 1 IC50
Activity Spreadsheet -- Enzyme Inhibition Constant Data from BindingDB
Found 1 hit for monomerid = 50148192
Trg + Lig
Ki
nM
ΔG°
kcal/mole
IC50
nM
Kd
nM
EC50/IC50
nM
koff
s-1
kon
M-1s-1
pHTemp
°C
Diacylglycerol lipase-alpha
(Homo sapiens (Human))
BDBM50148192
(CHEMBL3765578)
Show SMILES CC1(C)CCc2cc(ccc2O1)S(=O)(=O)N(CC(O)=O)C1(CCCC1)c1cccc(c1)-c1cc(Cl)cc(Cl)c1
Show InChI InChI=1S/C30H31Cl2NO5S/c1-29(2)13-10-21-17-26(8-9-27(21)38-29)39(36,37)33(19-28(34)35)30(11-3-4-12-30)23-7-5-6-20(14-23)22-15-24(31)18-25(32)16-22/h5-9,14-18H,3-4,10-13,19H2,1-2H3,(H,34,35)
NCI pathway
Reactome pathway
n/an/a 0.900n/an/an/an/an/an/a
Bristol-Myers Squibb Co.
Curated by ChEMBL
Assay Description
Inhibition of full length human C-terminal HA-tagged DAGLalpha expressed in HEK293 cell membrane using DAG as substrate incubated for 20 mins by LC-M...
Bioorg Med Chem 24: 1455-68 (2016)
BindingDB Entry DOI: 10.7270/Q2RJ4MBD