BDBM50148217 4-(4-Phenoxy-benzenesulfonylamino)-tetrahydro-pyran-4-carboxylic acid hydroxyamide::CHEMBL114148
SMILES: ONC(=O)C1(CCOCC1)NS(=O)(=O)c1ccc(Oc2ccccc2)cc1
InChI Key: InChIKey=FTIYYJYCHWIXRZ-UHFFFAOYSA-N
Data: 2 IC50
Activity Spreadsheet -- Enzyme Inhibition Constant Data from BindingDB
Found 2 hits for monomerid = 50148217
Trg + Lig
Ki
nM
ΔG°
kcal/mole
IC50
nM
Kd
nM
EC50/IC50
nM
koff
s-1
kon
M-1s-1
pHTemp
°C
Collagenase 3
(Homo sapiens (Human))
BDBM50148217
(4-(4-Phenoxy-benzenesulfonylamino)-tetrahydro-pyra...)
Show SMILES ONC(=O)C1(CCOCC1)NS(=O)(=O)c1ccc(Oc2ccccc2)cc1
Show InChI InChI=1S/C18H20N2O6S/c21-17(19-22)18(10-12-25-13-11-18)20-27(23,24)16-8-6-15(7-9-16)26-14-4-2-1-3-5-14/h1-9,20,22H,10-13H2,(H,19,21)
NCI pathway
Reactome pathway
n/an/a 1.5n/an/an/an/an/an/a
Pfizer Inc.
Curated by ChEMBL
Assay Description
Inhibitory activity against matrix metalloprotease-13 (MMP-13)
Bioorg Med Chem Lett 14: 3389-95 (2004)
Article DOI: 10.1016/j.bmcl.2004.04.083
BindingDB Entry DOI: 10.7270/Q25Q4WPN
Interstitial collagenase
(Homo sapiens (Human))
BDBM50148217
(4-(4-Phenoxy-benzenesulfonylamino)-tetrahydro-pyra...)
Show SMILES ONC(=O)C1(CCOCC1)NS(=O)(=O)c1ccc(Oc2ccccc2)cc1
Show InChI InChI=1S/C18H20N2O6S/c21-17(19-22)18(10-12-25-13-11-18)20-27(23,24)16-8-6-15(7-9-16)26-14-4-2-1-3-5-14/h1-9,20,22H,10-13H2,(H,19,21)
Reactome pathway
n/an/a 490n/an/an/an/an/an/a
Pfizer Inc.
Curated by ChEMBL
Assay Description
Inhibitory activity against human matrix metalloprotease-1 (MMP-1)
Bioorg Med Chem Lett 14: 3389-95 (2004)
Article DOI: 10.1016/j.bmcl.2004.04.083
BindingDB Entry DOI: 10.7270/Q25Q4WPN