BDBM50148227 (S)-3-[4-(4-Fluoro-phenoxy)-benzenesulfonylamino]-tetrahydro-furan-3-carboxylic acid hydroxyamide::CHEMBL114831
SMILES: ONC(=O)[C@@]1(CCOC1)NS(=O)(=O)c1ccc(Oc2ccc(F)cc2)cc1
InChI Key: InChIKey=YZIGEYGKVJNXSU-KRWDZBQOSA-N
Data: 2 IC50
Activity Spreadsheet -- Enzyme Inhibition Constant Data from BindingDB
Found 2 hits for monomerid = 50148227
Trg + Lig
Ki
nM
ΔG°
kcal/mole
IC50
nM
Kd
nM
EC50/IC50
nM
koff
s-1
kon
M-1s-1
pHTemp
°C
Interstitial collagenase
(Homo sapiens (Human))
BDBM50148227
((S)-3-[4-(4-Fluoro-phenoxy)-benzenesulfonylamino]-...)
Show SMILES ONC(=O)[C@@]1(CCOC1)NS(=O)(=O)c1ccc(Oc2ccc(F)cc2)cc1
Show InChI InChI=1S/C17H17FN2O6S/c18-12-1-3-13(4-2-12)26-14-5-7-15(8-6-14)27(23,24)20-17(16(21)19-22)9-10-25-11-17/h1-8,20,22H,9-11H2,(H,19,21)/t17-/m0/s1
Reactome pathway
n/an/a 1.20E+3n/an/an/an/an/an/a
Pfizer Inc.
Curated by ChEMBL
Assay Description
Inhibitory activity against human matrix metalloprotease-1 (MMP-1)
Bioorg Med Chem Lett 14: 3389-95 (2004)
Article DOI: 10.1016/j.bmcl.2004.04.083
BindingDB Entry DOI: 10.7270/Q25Q4WPN
Collagenase 3
(Homo sapiens (Human))
BDBM50148227
((S)-3-[4-(4-Fluoro-phenoxy)-benzenesulfonylamino]-...)
Show SMILES ONC(=O)[C@@]1(CCOC1)NS(=O)(=O)c1ccc(Oc2ccc(F)cc2)cc1
Show InChI InChI=1S/C17H17FN2O6S/c18-12-1-3-13(4-2-12)26-14-5-7-15(8-6-14)27(23,24)20-17(16(21)19-22)9-10-25-11-17/h1-8,20,22H,9-11H2,(H,19,21)/t17-/m0/s1
NCI pathway
Reactome pathway
n/an/a 1.30n/an/an/an/an/an/a
Pfizer Inc.
Curated by ChEMBL
Assay Description
Inhibitory activity against matrix metalloprotease-13 (MMP-13)
Bioorg Med Chem Lett 14: 3389-95 (2004)
Article DOI: 10.1016/j.bmcl.2004.04.083
BindingDB Entry DOI: 10.7270/Q25Q4WPN