BDBM50148228 1-[4-(4-Fluoro-phenoxy)-benzenesulfonylamino]-cyclobutanecarboxylic acid hydroxyamide::CHEMBL115283
SMILES: ONC(=O)C1(CCC1)NS(=O)(=O)c1ccc(Oc2ccc(F)cc2)cc1
InChI Key: InChIKey=SHSBTGZNXOPCNV-UHFFFAOYSA-N
Data: 2 IC50
Activity Spreadsheet -- Enzyme Inhibition Constant Data from BindingDB
Found 2 hits for monomerid = 50148228
Trg + Lig
Ki
nM
ΔG°
kcal/mole
IC50
nM
Kd
nM
EC50/IC50
nM
koff
s-1
kon
M-1s-1
pHTemp
°C
Collagenase 3
(Homo sapiens (Human))
BDBM50148228
(1-[4-(4-Fluoro-phenoxy)-benzenesulfonylamino]-cycl...)
Show SMILES ONC(=O)C1(CCC1)NS(=O)(=O)c1ccc(Oc2ccc(F)cc2)cc1
Show InChI InChI=1S/C17H17FN2O5S/c18-12-2-4-13(5-3-12)25-14-6-8-15(9-7-14)26(23,24)20-17(10-1-11-17)16(21)19-22/h2-9,20,22H,1,10-11H2,(H,19,21)
NCI pathway
Reactome pathway
n/an/a 0.530n/an/an/an/an/an/a
Pfizer Inc.
Curated by ChEMBL
Assay Description
Inhibitory activity against matrix metalloprotease-13 (MMP-13)
Bioorg Med Chem Lett 14: 3389-95 (2004)
Article DOI: 10.1016/j.bmcl.2004.04.083
BindingDB Entry DOI: 10.7270/Q25Q4WPN
Interstitial collagenase
(Homo sapiens (Human))
BDBM50148228
(1-[4-(4-Fluoro-phenoxy)-benzenesulfonylamino]-cycl...)
Show SMILES ONC(=O)C1(CCC1)NS(=O)(=O)c1ccc(Oc2ccc(F)cc2)cc1
Show InChI InChI=1S/C17H17FN2O5S/c18-12-2-4-13(5-3-12)25-14-6-8-15(9-7-14)26(23,24)20-17(10-1-11-17)16(21)19-22/h2-9,20,22H,1,10-11H2,(H,19,21)
Reactome pathway
n/an/a 280n/an/an/an/an/an/a
Pfizer Inc.
Curated by ChEMBL
Assay Description
Inhibitory activity against human matrix metalloprotease-1 (MMP-1)
Bioorg Med Chem Lett 14: 3389-95 (2004)
Article DOI: 10.1016/j.bmcl.2004.04.083
BindingDB Entry DOI: 10.7270/Q25Q4WPN