BDBM50148236 4-(2-Methoxymethyl-pyrrolidin-1-yl)-but-2-ynoic acid [4-(3-bromo-phenylamino)-3-cyano-quinolin-6-yl]-amide::CHEMBL117324
SMILES: COC[C@@H]1CCCN1CC#CC(=O)Nc1ccc2ncc(C#N)c(Nc3cccc(Br)c3)c2c1
InChI Key: InChIKey=CCUWFRBLNGOQSJ-QFIPXVFZSA-N
Data: 2 IC50
Activity Spreadsheet -- Enzyme Inhibition Constant Data from BindingDB
Found 2 hits for monomerid = 50148236
Trg + Lig
Ki
nM
ΔG°
kcal/mole
IC50
nM
Kd
nM
EC50/IC50
nM
koff
s-1
kon
M-1s-1
pHTemp
°C
Epidermal growth factor receptor
(Homo sapiens (Human))
BDBM50148236
(4-(2-Methoxymethyl-pyrrolidin-1-yl)-but-2-ynoic ac...)
Show SMILES COC[C@@H]1CCCN1CC#CC(=O)Nc1ccc2ncc(C#N)c(Nc3cccc(Br)c3)c2c1
Show InChI InChI=1S/C26H24BrN5O2/c1-34-17-22-7-3-11-32(22)12-4-8-25(33)30-21-9-10-24-23(14-21)26(18(15-28)16-29-24)31-20-6-2-5-19(27)13-20/h2,5-6,9-10,13-14,16,22H,3,7,11-12,17H2,1H3,(H,29,31)(H,30,33)/t22-/m0/s1
n/an/a 1.50E+5n/an/an/an/an/an/a
TBA
Assay Description
Inhibition of EGFR (unknown origin)
Citation and Details
Article DOI: 10.1007/s00044-004-0105-8
BindingDB Entry DOI: 10.7270/Q2NZ8BJH
Epidermal growth factor receptor
(Homo sapiens (Human))
BDBM50148236
(4-(2-Methoxymethyl-pyrrolidin-1-yl)-but-2-ynoic ac...)
Show SMILES COC[C@@H]1CCCN1CC#CC(=O)Nc1ccc2ncc(C#N)c(Nc3cccc(Br)c3)c2c1
Show InChI InChI=1S/C26H24BrN5O2/c1-34-17-22-7-3-11-32(22)12-4-8-25(33)30-21-9-10-24-23(14-21)26(18(15-28)16-29-24)31-20-6-2-5-19(27)13-20/h2,5-6,9-10,13-14,16,22H,3,7,11-12,17H2,1H3,(H,29,31)(H,30,33)/t22-/m0/s1
n/an/a 150n/an/an/an/an/an/a
Georgetown University
Curated by ChEMBL
Assay Description
Concentration required to inhibit autophosphorylation of cytoplasmic domain of epidermal growth factor receptor (EGFR)
Bioorg Med Chem Lett 14: 3397-400 (2004)
Article DOI: 10.1016/j.bmcl.2004.04.080
BindingDB Entry DOI: 10.7270/Q21Z4505